{"text_format":"1","workbook":"xlsx","n_sheets":15,"sheets":["obsah","Q7","Q8","Q9","Q10_1","Q10_2","Q10_3","Q10_4","Q10_5","Q10_6","Q10_7","Q10_8","Q10_9","Q10_10","Q10_11"],"not_rendered":{"charts":14,"images":0,"macros":0,"external_links":0,"defined_names":15,"comments":14,"pivot_tables":0},"unopened":[],"bounds":{"document_bytes":16777216,"sheet_cells":100000,"rows_first":2000,"rows_last":500,"rows_between":2000,"halvings":0,"cell_chars":16384,"cell_head_chars":4096},"cells_cut":0,"cells_raw":0,"read":"whole","date_system":"1900"}

{"sheet":"obsah","index":0,"n_rows":16,"n_cols":2,"rows_kept":16,"cut":false,"hidden":false,"merged":[]}
["OBSAH"]
[]
["Q7","Které aspekty související s komplexním rozvojem dítěte/žáka/studenta se podle Vás daří Vaší\nškole úspěšně realizovat?"]
["Q8","Které aspekty související s komplexním rozvojem dítěte/žáka/studenta se podle Vás nedaří Vaší\nškole realizovat, a uvítali byste v tomto ohledu podporu?"]
["Q9","Které z následujících položek nejvíce limitují komplexní rozvoj dětí/žáků/studentů ve Vaší škole? "]
["Q10_1","Vaše škola v posledních 12 měsících sociálně či jinak znevýhodněným dětem/žákům/studentům některou z vybraných položek?  q10_1  Školní obědy "]
["Q10_2","Vaše škola v posledních 12 měsících sociálně či jinak znevýhodněným dětem/žákům/studentům některou z vybraných položek?  q10_2  Stravování mimo obědy (svačiny, ovoce a zelenina, pitný režim mimo kohoutkovou vodu atp.) "]
["Q10_3","Vaše škola v posledních 12 měsících sociálně či jinak znevýhodněným dětem/žákům/studentům některou z vybraných položek?  q10_3  Školní pomůcky (psací potřeby, sešity, učebnice atp.)  "]
["Q10_4","Vaše škola v posledních 12 měsících sociálně či jinak znevýhodněným dětem/žákům/studentům některou z vybraných položek?  q10_4  Vstupné (např. do divadla, planetária, knihovny, ZOO atp.)  "]
["Q10_5","Vaše škola v posledních 12 měsících sociálně či jinak znevýhodněným dětem/žákům/studentům některou z vybraných položek?  q10_5  Náklady spojené s účastí na akcích pořádaných pro danou třídu (školní výlet, škola v přírodě atp.)  "]
["Q10_6","Vaše škola v posledních 12 měsících sociálně či jinak znevýhodněným dětem/žákům/studentům některou z vybraných položek?  q10_6  Náklady spojené s účastí na volitelných celoškolních akcích (např. zahraniční exkurze, lyžařské zájezdy atp.)  "]
["Q10_7","Vaše škola v posledních 12 měsících sociálně či jinak znevýhodněným dětem/žákům/studentům některou z vybraných položek?  q10_7  Náklady spojené s účastí na zájmovém vzdělávání (školní družiny, školní kluby, kroužky ve škole) "]
["Q10_8","Vaše škola v posledních 12 měsících sociálně či jinak znevýhodněným dětem/žákům/studentům některou z vybraných položek?  q10_8  Poplatky za kroužky konané mimo školu  "]
["Q10_9","Vaše škola v posledních 12 měsících sociálně či jinak znevýhodněným dětem/žákům/studentům některou z vybraných položek?  q10_9  Další materiální potřeby dítěte/žáka/studenta (např. vybavení na školní akce, školní taška, vybavení na tělesnou výchovu atp.)  "]
["Q10_10","Vaše škola v posledních 12 měsících sociálně či jinak znevýhodněným dětem/žákům/studentům některou z vybraných položek?  q10_10  Technické vybavení (notebook, tablet, internetové připojení atp.)  "]
["Q10_11","Vaše škola v posledních 12 měsících sociálně či jinak znevýhodněným dětem/žákům/studentům některou z vybraných položek?  q10_11  Doučování  "]

{"sheet":"Q7","index":1,"n_rows":104,"n_cols":23,"rows_kept":104,"cut":false,"hidden":false,"merged":[[2,3,2,16],[6,0,24,0],[26,0,44,0],[46,0,64,0],[66,0,66,1],[67,0,67,1]]}
["Které aspekty související s komplexním rozvojem dítěte/žáka/studenta se podle Vás daří Vaší\nškole úspěšně realizovat?"]
[]
["zpět na obsah",null,null,"Kraj"]
[null,null,"Celkem","Hlavní město Praha","Jihočeský kraj","Jihomoravský kraj","Karlovarský kraj","Kraj Vysočina","Královéhradecký kraj","Liberecký kraj","Moravskoslezský kraj","Olomoucký kraj","Pardubický kraj","Plzeňský kraj","Středočeský kraj","Ústecký kraj","Zlínský kraj"]
["Počet respondentů (N)",null,4324,340,272,539,100,241,261,197,397,318,259,218,629,296,256]
[]
["Četnost odpovědí","Rozvoj kreativity a tvořivosti ",3442,269,220,412,80,185,206,158,321,252,202,176,511,236,214]
[null,"Rozvoj potenciálu každého dítěte (individuální přístup ke vzdělávání, rozvoji a výchově dítěte) ",3435,273,212,413,86,199,211,161,294,257,205,179,498,239,207]
[null,"Mezilidské vztahy, podpora vzájemné komunikace a respektování vzájemných odlišností (sociální výchova) ",3234,279,202,394,77,174,190,149,284,230,180,164,487,223,201]
[null,"Rozvoj osobnosti dítěte (osobnostní výchova) ",3081,245,186,355,75,168,176,152,289,233,179,165,460,222,175]
[null,"Zdravý životní styl (výchova ke zdraví, rozvoj pohybových aktivit) ",3068,237,191,354,69,168,183,161,299,237,183,155,428,217,185]
[null,"Pozitivní vztah ke škole ",3019,237,190,374,70,169,185,128,281,229,169,156,434,216,181]
[null,"Podpora výuky v přírodě ",2644,193,170,299,59,153,174,128,220,207,172,151,374,192,151]
[null,"Well-being (zajištění tělesné a duševní pohody dětí) ",2341,198,144,255,58,122,139,118,231,185,130,118,349,148,145]
[null,"Rozvoj schopnosti učit se ",2062,179,124,251,44,110,113,105,197,165,110,106,297,136,125]
[null,"Rozvoj digitálních kompetencí ",1351,92,73,158,35,79,107,65,125,86,88,78,182,113,70]
[null,"Multikulturní rozvoj a rozvoj interkulturních kompetencí ",959,194,55,88,23,36,39,49,81,57,53,43,121,67,53]
[null,"Prevence (primární prevence, pozitivní trávení volného času, kyberbezpečnost, práce s dezinformacemi atp.) ",931,78,44,86,16,65,64,38,86,72,62,37,132,94,57]
[null,"Kritické myšlení a vnímání souvislostí ",824,71,53,100,11,44,39,30,94,52,50,40,140,51,48]
[null,"Vzdělávání a výchova k udržitelnosti ",476,64,34,51,7,16,32,25,35,32,33,20,69,37,21]
[null,"Formování občanských postojů (spojeno např. s výchovou demokratického občana) ",303,28,16,43,5,17,15,9,23,19,19,19,44,30,16]
[null,"Rozvoj podnikavosti ",98,9,6,11,1,7,8,5,13,10,5,3,11,4,5]
[null,"Růstové myšlení, výchova lídrů (osvojení principů) ",93,7,3,8,2,11,6,8,5,9,4,2,11,9,8]
[null,"Výchova k dobrovolnictví ",93,7,7,10,1,8,7,8,7,10,7,2,10,4,5]
[null,"Nedaří se nám realizovat žádný z uvedených aspektů",5,0,1,1,0,0,0,1,1,1,0,0,0,0,0]
[]
["Relativní četnost odpovědí (%)","Rozvoj kreativity a tvořivosti ",0.79602220166512483,0.79117647058823526,0.80882352941176472,0.76437847866419295,0.8,0.76763485477178428,0.78927203065134099,0.80203045685279184,0.80856423173803527,0.79245283018867929,0.77992277992277992,0.80733944954128445,0.81240063593004774,0.79729729729729726,0.8359375]
[null,"Rozvoj potenciálu každého dítěte (individuální přístup ke vzdělávání, rozvoji a výchově dítěte) ",0.79440333024976872,0.80294117647058827,0.77941176470588236,0.76623376623376627,0.86,0.82572614107883813,0.80842911877394641,0.81725888324873097,0.74055415617128462,0.80817610062893086,0.79150579150579148,0.82110091743119262,0.79173290937996821,0.80743243243243246,0.80859375]
[null,"Mezilidské vztahy, podpora vzájemné komunikace a respektování vzájemných odlišností (sociální výchova) ",0.74791859389454207,0.82058823529411762,0.74264705882352944,0.73098330241187381,0.77,0.72199170124481327,0.72796934865900387,0.75634517766497467,0.7153652392947103,0.72327044025157228,0.69498069498069504,0.75229357798165142,0.77424483306836245,0.7533783783783784,0.78515625]
[null,"Rozvoj osobnosti dítěte (osobnostní výchova) ",0.71253469010175763,0.72058823529411764,0.68382352941176472,0.65862708719851581,0.75,0.69709543568464727,0.67432950191570884,0.77157360406091369,0.72795969773299751,0.73270440251572322,0.69111969111969107,0.75688073394495414,0.7313195548489666,0.75,0.68359375]
[null,"Zdravý životní styl (výchova ke zdraví, rozvoj pohybových aktivit) ",0.70952821461609616,0.69705882352941173,0.70220588235294112,0.6567717996289425,0.69,0.69709543568464727,0.70114942528735635,0.81725888324873097,0.75314861460957183,0.74528301886792447,0.70656370656370659,0.71100917431192656,0.68044515103338632,0.73310810810810811,0.72265625]
[null,"Pozitivní vztah ke škole ",0.6981961147086031,0.69705882352941173,0.69852941176470584,0.69387755102040816,0.7,0.70124481327800825,0.70881226053639845,0.64974619289340096,0.70780856423173799,0.72012578616352196,0.65250965250965254,0.7155963302752294,0.68998410174880764,0.72972972972972971,0.70703125]
[null,"Podpora výuky v přírodě ",0.61147086031452358,0.56764705882352939,0.625,0.55473098330241188,0.59,0.63485477178423233,0.66666666666666663,0.64974619289340096,0.55415617128463479,0.65094339622641506,0.6640926640926641,0.69266055045871555,0.59459459459459463,0.64864864864864868,0.58984375]
[null,"Well-being (zajištění tělesné a duševní pohody dětí) ",0.54139685476410726,0.58235294117647063,0.52941176470588236,0.47309833024118736,0.57999999999999996,0.50622406639004147,0.53256704980842917,0.59898477157360408,0.58186397984886651,0.58176100628930816,0.50193050193050193,0.54128440366972475,0.55484896661367245,0.5,0.56640625]
[null,"Rozvoj schopnosti učit se ",0.4768732654949121,0.52647058823529413,0.45588235294117646,0.46567717996289426,0.44,0.45643153526970953,0.43295019157088122,0.53299492385786806,0.49622166246851385,0.51886792452830188,0.42471042471042469,0.48623853211009177,0.47217806041335453,0.45945945945945948,0.48828125]
[null,"Rozvoj digitálních kompetencí ",0.31244218316373729,0.27058823529411763,0.26838235294117646,0.29313543599257885,0.35,0.32780082987551867,0.40996168582375481,0.32994923857868019,0.31486146095717882,0.27044025157232704,0.33976833976833976,0.3577981651376147,0.28934817170111288,0.38175675675675674,0.2734375]
[null,"Multikulturní rozvoj a rozvoj interkulturních kompetencí ",0.22178538390379279,0.57058823529411762,0.20220588235294118,0.16326530612244897,0.23,0.14937759336099585,0.14942528735632185,0.24873096446700507,0.20403022670025189,0.17924528301886791,0.20463320463320464,0.19724770642201836,0.19236883942766295,0.22635135135135134,0.20703125]
[null,"Prevence (primární prevence, pozitivní trávení volného času, kyberbezpečnost, práce s dezinformacemi atp.) ",0.21530989824236818,0.22941176470588234,0.16176470588235295,0.15955473098330242,0.16,0.26970954356846472,0.24521072796934865,0.19289340101522842,0.21662468513853905,0.22641509433962265,0.23938223938223938,0.16972477064220184,0.20985691573926868,0.31756756756756754,0.22265625]
[null,"Kritické myšlení a vnímání souvislostí ",0.19056429232192415,0.20882352941176471,0.19485294117647059,0.18552875695732837,0.11,0.18257261410788381,0.14942528735632185,0.15228426395939088,0.23677581863979849,0.16352201257861634,0.19305019305019305,0.1834862385321101,0.22257551669316375,0.17229729729729729,0.1875]
[null,"Vzdělávání a výchova k udržitelnosti ",0.11008325624421832,0.18823529411764706,0.125,9.4619666048237475E-2,7.0000000000000007E-2,6.6390041493775934E-2,0.12260536398467432,0.12690355329949238,8.8161209068010074E-2,0.10062893081761007,0.12741312741312741,9.1743119266055051E-2,0.10969793322734499,0.125,8.203125E-2]
[null,"Formování občanských postojů (spojeno např. s výchovou demokratického občana) ",7.0074005550416277E-2,8.2352941176470587E-2,5.8823529411764705E-2,7.9777365491651209E-2,0.05,7.0539419087136929E-2,5.7471264367816091E-2,4.5685279187817257E-2,5.793450881612091E-2,5.9748427672955975E-2,7.3359073359073365E-2,8.7155963302752298E-2,6.9952305246422888E-2,0.10135135135135136,6.25E-2]
[null,"Rozvoj podnikavosti ",2.2664199814986123E-2,2.6470588235294117E-2,2.2058823529411766E-2,2.0408163265306121E-2,0.01,2.9045643153526972E-2,3.0651340996168581E-2,2.5380710659898477E-2,3.2745591939546598E-2,3.1446540880503145E-2,1.9305019305019305E-2,1.3761467889908258E-2,1.7488076311605722E-2,1.3513513513513514E-2,1.953125E-2]
[null,"Růstové myšlení, výchova lídrů (osvojení principů) ",2.1507863089731731E-2,2.0588235294117647E-2,1.1029411764705883E-2,1.4842300556586271E-2,0.02,4.5643153526970952E-2,2.2988505747126436E-2,4.060913705583756E-2,1.2594458438287154E-2,2.8301886792452831E-2,1.5444015444015444E-2,9.1743119266055051E-3,1.7488076311605722E-2,3.0405405405405407E-2,3.125E-2]
[null,"Výchova k dobrovolnictví ",2.1507863089731731E-2,2.0588235294117647E-2,2.5735294117647058E-2,1.8552875695732839E-2,0.01,3.3195020746887967E-2,2.681992337164751E-2,4.060913705583756E-2,1.7632241813602016E-2,3.1446540880503145E-2,2.7027027027027029E-2,9.1743119266055051E-3,1.5898251192368838E-2,1.3513513513513514E-2,1.953125E-2]
[null,"Nedaří se nám realizovat žádný z uvedených aspektů",1.1563367252543941E-3,0,3.6764705882352941E-3,1.8552875695732839E-3,0,0,0,5.076142131979695E-3,2.5188916876574307E-3,3.1446540880503146E-3,0,0,0,0,0]
[]
["Statistická\nvýznamnost","Rozvoj kreativity a tvořivosti ",null,"","","","","","","","","","","","","",""]
[null,"Rozvoj potenciálu každého dítěte (individuální přístup ke vzdělávání, rozvoji a výchově dítěte) ",null,"","","","","","","","--","","","","","",""]
[null,"Mezilidské vztahy, podpora vzájemné komunikace a respektování vzájemných odlišností (sociální výchova) ",null,"++","","","","","","","","","-","","","",""]
[null,"Rozvoj osobnosti dítěte (osobnostní výchova) ",null,"","","--","","","","","","","","","","",""]
[null,"Zdravý životní styl (výchova ke zdraví, rozvoj pohybových aktivit) ",null,"","","--","","","","+++","+","","","","","",""]
[null,"Pozitivní vztah ke škole ",null,"","","","","","","","","","","","","",""]
[null,"Podpora výuky v přírodě ",null,"","","--","","","","","-","","","+","","",""]
[null,"Well-being (zajištění tělesné a duševní pohody dětí) ",null,"","","---","","","","","","","","","","",""]
[null,"Rozvoj schopnosti učit se ",null,"","","","","","","","","","","","","",""]
[null,"Rozvoj digitálních kompetencí ",null,"","","","","","+++","","","","","","","++",""]
[null,"Multikulturní rozvoj a rozvoj interkulturních kompetencí ",null,"+++","","---","","--","--","","","","","","","",""]
[null,"Prevence (primární prevence, pozitivní trávení volného času, kyberbezpečnost, práce s dezinformacemi atp.) ",null,"","-","---","","+","","","","","","","","+++",""]
[null,"Kritické myšlení a vnímání souvislostí ",null,"","","","-","","","","+","","","","+","",""]
[null,"Vzdělávání a výchova k udržitelnosti ",null,"+++","","","","-","","","","","","","","",""]
[null,"Formování občanských postojů (spojeno např. s výchovou demokratického občana) ",null,"","","","","","","","","","","","","+",""]
[null,"Rozvoj podnikavosti ",null,"","","","","","","","","","","","","",""]
[null,"Růstové myšlení, výchova lídrů (osvojení principů) ",null,"","","","","++","","","","","","","","",""]
[null,"Výchova k dobrovolnictví ",null,"","","","","","","","","","","","","",""]
[null,"Nedaří se nám realizovat žádný z uvedených aspektů",null,"","","","","","","","","","","","","",""]
[]
["Celkem"]
["vyberte kategorii ze seznamu"]
[]
[]
[]
[]
[]
[]
[]
[]
[]
[]
[]
[]
[]
[]
[null,null,null,null,null," výběr více odpovědí",null,null,null,"výběr jedné odpovědi",null,null,null," všichni respondenti"]
[]
[]
[null,null,null,null,null,null,null,null,null,null,null,null,null,null,null,null,null,null,{"$f":"A1&\" | \"&A67&\" | N=\"&INDEX($5:$5,1,$T$86)","v":"Které aspekty související s komplexním rozvojem dítěte/žáka/studenta se podle Vás daří Vaší\nškole úspěšně realizovat? | Celkem | N=4324"},{"$f":"MATCH($A$67,$4:$4,0)","v":3},{"$f":"INDEX($27:$45,W86,MATCH($A$67,$4:$4,0))","v":0.79602220166512483},{"$f":"INDEX($27:$45,W86,3)","v":0.79602220166512483},1]
[null,null,null,null,null,null,null,null,null,null,null,null,null,null,null,null,null,null,null,null,{"$f":"INDEX($27:$45,W87,MATCH($A$67,$4:$4,0))","v":0.79440333024976872},{"$f":"INDEX($27:$45,W87,3)","v":0.79440333024976872},2]
[null,null,null,null,null,null,null,null,null,null,null,null,null,null,null,null,null,null,null,null,{"$f":"INDEX($27:$45,W88,MATCH($A$67,$4:$4,0))","v":0.74791859389454207},{"$f":"INDEX($27:$45,W88,3)","v":0.74791859389454207},3]
[null,null,null,null,null,null,null,null,null,null,null,null,null,null,null,null,null,null,null,null,{"$f":"INDEX($27:$45,W89,MATCH($A$67,$4:$4,0))","v":0.71253469010175763},{"$f":"INDEX($27:$45,W89,3)","v":0.71253469010175763},4]
[null,null,null,null,null,null,null,null,null,null,null,null,null,null,null,null,null,null,null,null,{"$f":"INDEX($27:$45,W90,MATCH($A$67,$4:$4,0))","v":0.70952821461609616},{"$f":"INDEX($27:$45,W90,3)","v":0.70952821461609616},5]
[null,null,null,null,null,null,null,null,null,null,null,null,null,null,null,null,null,null,null,null,{"$f":"INDEX($27:$45,W91,MATCH($A$67,$4:$4,0))","v":0.6981961147086031},{"$f":"INDEX($27:$45,W91,3)","v":0.6981961147086031},6]
[null,null,null,null,null,null,null,null,null,null,null,null,null,null,null,null,null,null,null,null,{"$f":"INDEX($27:$45,W92,MATCH($A$67,$4:$4,0))","v":0.61147086031452358},{"$f":"INDEX($27:$45,W92,3)","v":0.61147086031452358},7]
[null,null,null,null,null,null,null,null,null,null,null,null,null,null,null,null,null,null,null,null,{"$f":"INDEX($27:$45,W93,MATCH($A$67,$4:$4,0))","v":0.54139685476410726},{"$f":"INDEX($27:$45,W93,3)","v":0.54139685476410726},8]
[null,null,null,null,null,null,null,null,null,null,null,null,null,null,null,null,null,null,null,null,{"$f":"INDEX($27:$45,W94,MATCH($A$67,$4:$4,0))","v":0.4768732654949121},{"$f":"INDEX($27:$45,W94,3)","v":0.4768732654949121},9]
[null,null,null,null,null,null,null,null,null,null,null,null,null,null,null,null,null,null,null,null,{"$f":"INDEX($27:$45,W95,MATCH($A$67,$4:$4,0))","v":0.31244218316373729},{"$f":"INDEX($27:$45,W95,3)","v":0.31244218316373729},10]
[null,null,null,null,null,null,null,null,null,null,null,null,null,null,null,null,null,null,null,null,{"$f":"INDEX($27:$45,W96,MATCH($A$67,$4:$4,0))","v":0.22178538390379279},{"$f":"INDEX($27:$45,W96,3)","v":0.22178538390379279},11]
[null,null,null,null,null,null,null,null,null,null,null,null,null,null,null,null,null,null,null,null,{"$f":"INDEX($27:$45,W97,MATCH($A$67,$4:$4,0))","v":0.21530989824236818},{"$f":"INDEX($27:$45,W97,3)","v":0.21530989824236818},12]
[null,null,null,null,null,null,null,null,null,null,null,null,null,null,null,null,null,null,null,null,{"$f":"INDEX($27:$45,W98,MATCH($A$67,$4:$4,0))","v":0.19056429232192415},{"$f":"INDEX($27:$45,W98,3)","v":0.19056429232192415},13]
[null,null,null,null,null,null,null,null,null,null,null,null,null,null,null,null,null,null,null,null,{"$f":"INDEX($27:$45,W99,MATCH($A$67,$4:$4,0))","v":0.11008325624421832},{"$f":"INDEX($27:$45,W99,3)","v":0.11008325624421832},14]
[null,null,null,null,null,null,null,null,null,null,null,null,null,null,null,null,null,null,null,null,{"$f":"INDEX($27:$45,W100,MATCH($A$67,$4:$4,0))","v":7.0074005550416277E-2},{"$f":"INDEX($27:$45,W100,3)","v":7.0074005550416277E-2},15]
[null,null,null,null,null,null,null,null,null,null,null,null,null,null,null,null,null,null,null,null,{"$f":"INDEX($27:$45,W101,MATCH($A$67,$4:$4,0))","v":2.2664199814986123E-2},{"$f":"INDEX($27:$45,W101,3)","v":2.2664199814986123E-2},16]
[null,null,null,null,null,null,null,null,null,null,null,null,null,null,null,null,null,null,null,null,{"$f":"INDEX($27:$45,W102,MATCH($A$67,$4:$4,0))","v":2.1507863089731731E-2},{"$f":"INDEX($27:$45,W102,3)","v":2.1507863089731731E-2},17]
[null,null,null,null,null,null,null,null,null,null,null,null,null,null,null,null,null,null,null,null,{"$f":"INDEX($27:$45,W103,MATCH($A$67,$4:$4,0))","v":2.1507863089731731E-2},{"$f":"INDEX($27:$45,W103,3)","v":2.1507863089731731E-2},18]
[null,null,null,null,null,null,null,null,null,null,null,null,null,null,null,null,null,null,null,null,{"$f":"INDEX($27:$45,W104,MATCH($A$67,$4:$4,0))","v":1.1563367252543941E-3},{"$f":"INDEX($27:$45,W104,3)","v":1.1563367252543941E-3},19]

{"sheet":"Q8","index":2,"n_rows":104,"n_cols":23,"rows_kept":104,"cut":false,"hidden":false,"merged":[[2,3,2,16],[6,0,24,0],[26,0,44,0],[46,0,64,0],[66,0,66,1],[67,0,67,1]]}
["Které aspekty související s komplexním rozvojem dítěte/žáka/studenta se podle Vás nedaří Vaší\nškole realizovat, a uvítali byste v tomto ohledu podporu?"]
[]
["zpět na obsah",null,null,"Kraj"]
[null,null,"Celkem","Hlavní město Praha","Jihočeský kraj","Jihomoravský kraj","Karlovarský kraj","Kraj Vysočina","Královéhradecký kraj","Liberecký kraj","Moravskoslezský kraj","Olomoucký kraj","Pardubický kraj","Plzeňský kraj","Středočeský kraj","Ústecký kraj","Zlínský kraj"]
["Počet respondentů (N)",null,4324,340,272,539,100,241,261,197,397,318,259,218,629,296,256]
[]
["Četnost odpovědí","Rozvoj podnikavosti ",1272,106,74,160,35,77,76,54,137,97,60,56,180,92,68]
[null,"Růstové myšlení, výchova lídrů (osvojení principů) ",1259,94,78,157,28,64,85,55,126,107,77,59,163,91,75]
[null,"Rozvoj digitálních kompetencí ",1106,90,73,149,20,73,49,48,93,80,68,59,160,68,76]
[null,"Kritické myšlení a vnímání souvislostí ",985,63,60,120,21,64,65,35,109,78,70,38,132,75,55]
[null,"Výchova k dobrovolnictví ",971,78,58,117,18,56,51,49,98,74,55,49,145,68,54]
[null,"Formování občanských postojů (spojeno např. s výchovou demokratického občana) ",590,52,41,65,12,40,29,28,49,48,38,32,84,35,36]
[null,"Prevence (primární prevence, pozitivní trávení volného času, kyberbezpečnost, práce s dezinformacemi atp.) ",587,45,46,69,12,24,27,38,47,43,35,36,86,40,39]
[null,"Vzdělávání a výchova k udržitelnosti ",579,51,32,70,11,40,31,26,67,50,30,21,73,45,32]
[null,"Multikulturní rozvoj a rozvoj interkulturních kompetencí ",565,20,32,85,10,32,24,30,53,48,36,27,86,48,33]
[null,"Rozvoj potenciálu každého dítěte (individuální přístup ke vzdělávání, rozvoji a výchově dítěte) ",387,35,20,50,5,22,24,15,34,20,26,18,59,38,21]
[null,"Podpora výuky v přírodě ",366,34,22,58,6,19,21,16,28,25,25,11,54,24,23]
[null,"Rozvoj schopnosti učit se ",316,23,16,44,8,23,18,9,23,11,22,21,42,32,24]
[null,"Well-being (zajištění tělesné a duševní pohody dětí) ",279,21,10,50,3,18,13,11,35,21,14,10,40,20,13]
[null,"Mezilidské vztahy, podpora vzájemné komunikace a respektování vzájemných odlišností (sociální výchova) ",261,17,23,42,4,14,16,13,28,10,17,16,31,19,11]
[null,"Zdravý životní styl (výchova ke zdraví, rozvoj pohybových aktivit) ",204,19,10,31,4,10,11,9,21,10,7,13,25,22,12]
[null,"Rozvoj osobnosti dítěte (osobnostní výchova)",168,11,9,24,4,6,9,9,11,10,12,8,30,16,9]
[null,"Rozvoj kreativity a tvořivosti ",161,11,11,25,2,7,9,7,14,11,9,10,19,15,10]
[null,"Pozitivní vztah ke škole ",125,7,6,17,1,8,8,5,7,4,9,9,22,13,8]
[null,"V žádné z uvedených oblastí",842,83,51,94,28,35,57,40,74,61,46,49,119,55,50]
[]
["Relativní četnost odpovědí (%)","Rozvoj podnikavosti ",0.29417206290471787,0.31176470588235294,0.27205882352941174,0.29684601113172543,0.35,0.31950207468879666,0.29118773946360155,0.27411167512690354,0.34508816120906799,0.30503144654088049,0.23166023166023167,0.25688073394495414,0.2861685214626391,0.3108108108108108,0.265625]
[null,"Růstové myšlení, výchova lídrů (osvojení principů) ",0.2911655874190564,0.27647058823529413,0.28676470588235292,0.29128014842300559,0.28000000000000003,0.26556016597510373,0.32567049808429116,0.27918781725888325,0.31738035264483627,0.33647798742138363,0.29729729729729731,0.27064220183486237,0.25914149443561207,0.30743243243243246,0.29296875]
[null,"Rozvoj digitálních kompetencí ",0.25578168362627196,0.26470588235294118,0.26838235294117646,0.27643784786641928,0.2,0.30290456431535268,0.18773946360153257,0.24365482233502539,0.23425692695214106,0.25157232704402516,0.26254826254826252,0.27064220183486237,0.25437201907790141,0.22972972972972974,0.296875]
[null,"Kritické myšlení a vnímání souvislostí ",0.22779833487511564,0.18529411764705883,0.22058823529411764,0.22263450834879406,0.21,0.26556016597510373,0.24904214559386972,0.17766497461928935,0.27455919395465994,0.24528301886792453,0.27027027027027029,0.1743119266055046,0.20985691573926868,0.2533783783783784,0.21484375]
[null,"Výchova k dobrovolnictví ",0.22456059204440332,0.22941176470588234,0.21323529411764705,0.21706864564007422,0.18,0.23236514522821577,0.19540229885057472,0.24873096446700507,0.24685138539042822,0.23270440251572327,0.21235521235521235,0.22477064220183487,0.23052464228934816,0.22972972972972974,0.2109375]
[null,"Formování občanských postojů (spojeno např. s výchovou demokratického občana) ",0.13644773358001849,0.15294117647058825,0.15073529411764705,0.12059369202226346,0.12,0.16597510373443983,0.1111111111111111,0.14213197969543148,0.12342569269521411,0.15094339622641509,0.14671814671814673,0.14678899082568808,0.13354531001589826,0.11824324324324324,0.140625]
[null,"Prevence (primární prevence, pozitivní trávení volného času, kyberbezpečnost, práce s dezinformacemi atp.) ",0.13575393154486587,0.13235294117647059,0.16911764705882354,0.1280148423005566,0.12,9.9585062240663894E-2,0.10344827586206896,0.19289340101522842,0.11838790931989925,0.13522012578616352,0.13513513513513514,0.16513761467889909,0.13672496025437203,0.13513513513513514,0.15234375]
[null,"Vzdělávání a výchova k udržitelnosti ",0.13390379278445882,0.15,0.11764705882352941,0.12987012987012986,0.11,0.16597510373443983,0.11877394636015326,0.13197969543147209,0.16876574307304787,0.15723270440251572,0.11583011583011583,9.6330275229357804E-2,0.11605723370429252,0.15202702702702703,0.125]
[null,"Multikulturní rozvoj a rozvoj interkulturních kompetencí ",0.13066604995374653,5.8823529411764705E-2,0.11764705882352941,0.15769944341372913,0.1,0.13278008298755187,9.1954022988505746E-2,0.15228426395939088,0.13350125944584382,0.15094339622641509,0.138996138996139,0.12385321100917432,0.13672496025437203,0.16216216216216217,0.12890625]
[null,"Rozvoj potenciálu každého dítěte (individuální přístup ke vzdělávání, rozvoji a výchově dítěte) ",8.9500462534690101E-2,0.10294117647058823,7.3529411764705885E-2,9.2764378478664186E-2,0.05,9.1286307053941904E-2,9.1954022988505746E-2,7.6142131979695438E-2,8.5642317380352648E-2,6.2893081761006289E-2,0.10038610038610038,8.2568807339449546E-2,9.3799682034976156E-2,0.12837837837837837,8.203125E-2]
[null,"Podpora výuky v přírodě ",8.4643848288621648E-2,0.1,8.0882352941176475E-2,0.10760667903525047,0.06,7.8838174273858919E-2,8.0459770114942528E-2,8.1218274111675121E-2,7.0528967254408062E-2,7.8616352201257858E-2,9.6525096525096526E-2,5.0458715596330278E-2,8.5850556438791734E-2,8.1081081081081086E-2,8.984375E-2]
[null,"Rozvoj schopnosti učit se ",7.3080481036077699E-2,6.7647058823529407E-2,5.8823529411764705E-2,8.1632653061224483E-2,0.08,9.5435684647302899E-2,6.8965517241379309E-2,4.5685279187817257E-2,5.793450881612091E-2,3.4591194968553458E-2,8.4942084942084939E-2,9.6330275229357804E-2,6.6772655007949128E-2,0.10810810810810811,9.375E-2]
[null,"Well-being (zajištění tělesné a duševní pohody dětí) ",6.4523589269195186E-2,6.1764705882352944E-2,3.6764705882352942E-2,9.2764378478664186E-2,0.03,7.4688796680497924E-2,4.9808429118773943E-2,5.5837563451776651E-2,8.8161209068010074E-2,6.6037735849056603E-2,5.4054054054054057E-2,4.5871559633027525E-2,6.3593004769475353E-2,6.7567567567567571E-2,5.078125E-2]
[null,"Mezilidské vztahy, podpora vzájemné komunikace a respektování vzájemných odlišností (sociální výchova) ",6.0360777058279372E-2,0.05,8.455882352941177E-2,7.792207792207792E-2,0.04,5.8091286307053944E-2,6.1302681992337162E-2,6.5989847715736044E-2,7.0528967254408062E-2,3.1446540880503145E-2,6.5637065637065631E-2,7.3394495412844041E-2,4.9284578696343402E-2,6.4189189189189186E-2,4.296875E-2]
[null,"Zdravý životní styl (výchova ke zdraví, rozvoj pohybových aktivit) ",4.7178538390379277E-2,5.5882352941176473E-2,3.6764705882352942E-2,5.7513914656771803E-2,0.04,4.1493775933609957E-2,4.2145593869731802E-2,4.5685279187817257E-2,5.2896725440806043E-2,3.1446540880503145E-2,2.7027027027027029E-2,5.9633027522935783E-2,3.9745627980922099E-2,7.4324324324324328E-2,4.6875E-2]
[null,"Rozvoj osobnosti dítěte (osobnostní výchova)",3.8852913968547641E-2,3.2352941176470591E-2,3.3088235294117647E-2,4.4526901669758812E-2,0.04,2.4896265560165973E-2,3.4482758620689655E-2,4.5685279187817257E-2,2.7707808564231738E-2,3.1446540880503145E-2,4.633204633204633E-2,3.669724770642202E-2,4.7694753577106522E-2,5.4054054054054057E-2,3.515625E-2]
[null,"Rozvoj kreativity a tvořivosti ",3.7234042553191488E-2,3.2352941176470591E-2,4.0441176470588237E-2,4.6382189239332093E-2,0.02,2.9045643153526972E-2,3.4482758620689655E-2,3.553299492385787E-2,3.5264483627204031E-2,3.4591194968553458E-2,3.4749034749034749E-2,4.5871559633027525E-2,3.0206677265500796E-2,5.0675675675675678E-2,3.90625E-2]
[null,"Pozitivní vztah ke škole ",2.8908418131359852E-2,2.0588235294117647E-2,2.2058823529411766E-2,3.1539888682745827E-2,0.01,3.3195020746887967E-2,3.0651340996168581E-2,2.5380710659898477E-2,1.7632241813602016E-2,1.2578616352201259E-2,3.4749034749034749E-2,4.1284403669724773E-2,3.4976152623211444E-2,4.3918918918918921E-2,3.125E-2]
[null,"V žádné z uvedených oblastí",0.19472710453283995,0.24411764705882352,0.1875,0.17439703153988867,0.28000000000000003,0.14522821576763487,0.21839080459770116,0.20304568527918782,0.18639798488664988,0.1918238993710692,0.17760617760617761,0.22477064220183487,0.1891891891891892,0.1858108108108108,0.1953125]
[]
["Statistická\nvýznamnost","Rozvoj podnikavosti ",null,"","","","","","","","+","","-","","","",""]
[null,"Růstové myšlení, výchova lídrů (osvojení principů) ",null,"","","","","","","","","","","","","",""]
[null,"Rozvoj digitálních kompetencí ",null,"","","","","","--","","","","","","","",""]
[null,"Kritické myšlení a vnímání souvislostí ",null,"","","","","","","","+","","","","","",""]
[null,"Výchova k dobrovolnictví ",null,"","","","","","","","","","","","","",""]
[null,"Formování občanských postojů (spojeno např. s výchovou demokratického občana) ",null,"","","","","","","","","","","","","",""]
[null,"Prevence (primární prevence, pozitivní trávení volného času, kyberbezpečnost, práce s dezinformacemi atp.) ",null,"","","","","","","+","","","","","","",""]
[null,"Vzdělávání a výchova k udržitelnosti ",null,"","","","","","","","+","","","","","",""]
[null,"Multikulturní rozvoj a rozvoj interkulturních kompetencí ",null,"---","","+","","","","","","","","","","",""]
[null,"Rozvoj potenciálu každého dítěte (individuální přístup ke vzdělávání, rozvoji a výchově dítěte) ",null,"","","","","","","","","","","","","+",""]
[null,"Podpora výuky v přírodě ",null,"","","+","","","","","","","","","","",""]
[null,"Rozvoj schopnosti učit se ",null,"","","","","","","","","--","","","","+",""]
[null,"Well-being (zajištění tělesné a duševní pohody dětí) ",null,"","","++","","","","","+","","","","","",""]
[null,"Mezilidské vztahy, podpora vzájemné komunikace a respektování vzájemných odlišností (sociální výchova) ",null,"","","","","","","","","-","","","","",""]
[null,"Zdravý životní styl (výchova ke zdraví, rozvoj pohybových aktivit) ",null,"","","","","","","","","","","","","+",""]
[null,"Rozvoj osobnosti dítěte (osobnostní výchova)",null,"","","","","","","","","","","","","",""]
[null,"Rozvoj kreativity a tvořivosti ",null,"","","","","","","","","","","","","",""]
[null,"Pozitivní vztah ke škole ",null,"","","","","","","","","","","","","",""]
[null,"V žádné z uvedených oblastí",null,"+","","","+","-","","","","","","","","",""]
[]
["Celkem"]
["vyberte kategorii ze seznamu"]
[]
[]
[]
[]
[]
[]
[]
[]
[]
[]
[]
[]
[]
[]
[null,null,null,null,null," výběr více odpovědí",null,null,null,"výběr jedné odpovědi",null,null,null," všichni respondenti"]
[]
[]
[null,null,null,null,null,null,null,null,null,null,null,null,null,null,null,null,null,null,{"$f":"A1&\" | \"&A67&\" | N=\"&INDEX($5:$5,1,$T$86)","v":"Které aspekty související s komplexním rozvojem dítěte/žáka/studenta se podle Vás nedaří Vaší\nškole realizovat, a uvítali byste v tomto ohledu podporu? | Celkem | N=4324"},{"$f":"MATCH($A$67,$4:$4,0)","v":3},{"$f":"INDEX($27:$45,W86,MATCH($A$67,$4:$4,0))","v":0.29417206290471787},{"$f":"INDEX($27:$45,W86,3)","v":0.29417206290471787},1]
[null,null,null,null,null,null,null,null,null,null,null,null,null,null,null,null,null,null,null,null,{"$f":"INDEX($27:$45,W87,MATCH($A$67,$4:$4,0))","v":0.2911655874190564},{"$f":"INDEX($27:$45,W87,3)","v":0.2911655874190564},2]
[null,null,null,null,null,null,null,null,null,null,null,null,null,null,null,null,null,null,null,null,{"$f":"INDEX($27:$45,W88,MATCH($A$67,$4:$4,0))","v":0.25578168362627196},{"$f":"INDEX($27:$45,W88,3)","v":0.25578168362627196},3]
[null,null,null,null,null,null,null,null,null,null,null,null,null,null,null,null,null,null,null,null,{"$f":"INDEX($27:$45,W89,MATCH($A$67,$4:$4,0))","v":0.22779833487511564},{"$f":"INDEX($27:$45,W89,3)","v":0.22779833487511564},4]
[null,null,null,null,null,null,null,null,null,null,null,null,null,null,null,null,null,null,null,null,{"$f":"INDEX($27:$45,W90,MATCH($A$67,$4:$4,0))","v":0.22456059204440332},{"$f":"INDEX($27:$45,W90,3)","v":0.22456059204440332},5]
[null,null,null,null,null,null,null,null,null,null,null,null,null,null,null,null,null,null,null,null,{"$f":"INDEX($27:$45,W91,MATCH($A$67,$4:$4,0))","v":0.13644773358001849},{"$f":"INDEX($27:$45,W91,3)","v":0.13644773358001849},6]
[null,null,null,null,null,null,null,null,null,null,null,null,null,null,null,null,null,null,null,null,{"$f":"INDEX($27:$45,W92,MATCH($A$67,$4:$4,0))","v":0.13575393154486587},{"$f":"INDEX($27:$45,W92,3)","v":0.13575393154486587},7]
[null,null,null,null,null,null,null,null,null,null,null,null,null,null,null,null,null,null,null,null,{"$f":"INDEX($27:$45,W93,MATCH($A$67,$4:$4,0))","v":0.13390379278445882},{"$f":"INDEX($27:$45,W93,3)","v":0.13390379278445882},8]
[null,null,null,null,null,null,null,null,null,null,null,null,null,null,null,null,null,null,null,null,{"$f":"INDEX($27:$45,W94,MATCH($A$67,$4:$4,0))","v":0.13066604995374653},{"$f":"INDEX($27:$45,W94,3)","v":0.13066604995374653},9]
[null,null,null,null,null,null,null,null,null,null,null,null,null,null,null,null,null,null,null,null,{"$f":"INDEX($27:$45,W95,MATCH($A$67,$4:$4,0))","v":8.9500462534690101E-2},{"$f":"INDEX($27:$45,W95,3)","v":8.9500462534690101E-2},10]
[null,null,null,null,null,null,null,null,null,null,null,null,null,null,null,null,null,null,null,null,{"$f":"INDEX($27:$45,W96,MATCH($A$67,$4:$4,0))","v":8.4643848288621648E-2},{"$f":"INDEX($27:$45,W96,3)","v":8.4643848288621648E-2},11]
[null,null,null,null,null,null,null,null,null,null,null,null,null,null,null,null,null,null,null,null,{"$f":"INDEX($27:$45,W97,MATCH($A$67,$4:$4,0))","v":7.3080481036077699E-2},{"$f":"INDEX($27:$45,W97,3)","v":7.3080481036077699E-2},12]
[null,null,null,null,null,null,null,null,null,null,null,null,null,null,null,null,null,null,null,null,{"$f":"INDEX($27:$45,W98,MATCH($A$67,$4:$4,0))","v":6.4523589269195186E-2},{"$f":"INDEX($27:$45,W98,3)","v":6.4523589269195186E-2},13]
[null,null,null,null,null,null,null,null,null,null,null,null,null,null,null,null,null,null,null,null,{"$f":"INDEX($27:$45,W99,MATCH($A$67,$4:$4,0))","v":6.0360777058279372E-2},{"$f":"INDEX($27:$45,W99,3)","v":6.0360777058279372E-2},14]
[null,null,null,null,null,null,null,null,null,null,null,null,null,null,null,null,null,null,null,null,{"$f":"INDEX($27:$45,W100,MATCH($A$67,$4:$4,0))","v":4.7178538390379277E-2},{"$f":"INDEX($27:$45,W100,3)","v":4.7178538390379277E-2},15]
[null,null,null,null,null,null,null,null,null,null,null,null,null,null,null,null,null,null,null,null,{"$f":"INDEX($27:$45,W101,MATCH($A$67,$4:$4,0))","v":3.8852913968547641E-2},{"$f":"INDEX($27:$45,W101,3)","v":3.8852913968547641E-2},16]
[null,null,null,null,null,null,null,null,null,null,null,null,null,null,null,null,null,null,null,null,{"$f":"INDEX($27:$45,W102,MATCH($A$67,$4:$4,0))","v":3.7234042553191488E-2},{"$f":"INDEX($27:$45,W102,3)","v":3.7234042553191488E-2},17]
[null,null,null,null,null,null,null,null,null,null,null,null,null,null,null,null,null,null,null,null,{"$f":"INDEX($27:$45,W103,MATCH($A$67,$4:$4,0))","v":2.8908418131359852E-2},{"$f":"INDEX($27:$45,W103,3)","v":2.8908418131359852E-2},18]
[null,null,null,null,null,null,null,null,null,null,null,null,null,null,null,null,null,null,null,null,{"$f":"INDEX($27:$45,W104,MATCH($A$67,$4:$4,0))","v":0.19472710453283995},{"$f":"INDEX($27:$45,W104,3)","v":0.19472710453283995},19]

{"sheet":"Q9","index":3,"n_rows":76,"n_cols":23,"rows_kept":76,"cut":false,"hidden":false,"merged":[[2,3,2,16],[6,0,17,0],[19,0,30,0],[32,0,43,0],[45,0,45,1],[46,0,46,1]]}
["Které z následujících položek nejvíce limitují komplexní rozvoj dětí/žáků/studentů ve Vaší škole? "]
[]
["zpět na obsah",null,null,"Kraj"]
[null,null,"Celkem","Hlavní město Praha","Jihočeský kraj","Jihomoravský kraj","Karlovarský kraj","Kraj Vysočina","Královéhradecký kraj","Liberecký kraj","Moravskoslezský kraj","Olomoucký kraj","Pardubický kraj","Plzeňský kraj","Středočeský kraj","Ústecký kraj","Zlínský kraj"]
["Počet respondentů (N)",null,4324,340,272,539,100,241,261,197,397,318,259,218,629,296,256]
[]
["Četnost odpovědí","Nedostatečná kapacita školních psychologů, speciálních pedagogů, sociálních pedagogů a dalších pozic",2189,178,145,253,60,117,130,85,216,121,148,118,334,166,117]
[null,"Vliv rodiny a dalších osob v blízkém okolí ",2136,141,151,257,56,102,136,101,182,168,126,121,304,175,116]
[null,"Nedostatečná časová kapacita pedagogických pracovníků věnovat se individuálnímu a zároveň komplexnímu rozvoji každého dítěte/žáka/studenta",2007,176,116,260,40,115,136,89,195,139,118,84,297,121,121]
[null,"Vliv sociálních sítí a médií (např. youtubeři) ",1103,64,72,145,27,67,67,62,91,84,63,60,135,89,77]
[null,"Vysoká absence dětí/žáků/studentů ",798,44,48,106,28,40,44,42,69,72,45,43,113,66,38]
[null,"Nejasná definice toho, co komplexní rozvoj dítěte/žáka/studenta vlastně zahrnuje ",540,42,29,68,15,38,34,32,36,46,26,23,81,31,39]
[null,"Nízká motivace samotných dětí/žáků/studentů ",524,29,34,72,13,32,38,26,62,45,22,23,58,49,21]
[null,"Nedostatečné materiální zabezpečení žáků/dětí/studentů (např. chybějící psací potřeby\na další pomůcky, nedostatečné prostředky na úhradu školních výletů, obědů atp.)",510,29,30,67,6,40,27,31,60,41,33,15,63,37,30]
[null,"Neuspokojivá spolupráce se školskými poradenskými zařízeními (pedagogickopsychologickými poradnami, speciálně pedagogickými centry)",498,67,21,62,8,25,17,12,33,32,32,25,112,32,20]
[null,"Nedostatečná metodická podpora pedagogických pracovníků ",378,33,31,57,7,22,20,12,44,29,26,10,49,15,23]
[null,"Nedostatečná podpora ze strany zřizovatele ",137,9,13,20,1,7,5,5,12,11,7,7,24,7,8]
[null,"Neochota pedagogických pracovníků přistupovat k dětem/žákům/studentům individuálně a vnímat je jako osobnosti ",101,10,7,14,2,3,5,1,6,7,11,2,14,13,6]
[]
["Relativní četnost odpovědí (%)","Nedostatečná kapacita školních psychologů, speciálních pedagogů, sociálních pedagogů a dalších pozic",0.50624421831637367,0.52352941176470591,0.53308823529411764,0.46938775510204084,0.6,0.48547717842323651,0.49808429118773945,0.43147208121827413,0.54408060453400509,0.38050314465408808,0.5714285714285714,0.54128440366972475,0.53100158982511925,0.56081081081081086,0.45703125]
[null,"Vliv rodiny a dalších osob v blízkém okolí ",0.49398704902867713,0.4147058823529412,0.55514705882352944,0.47680890538033394,0.56000000000000005,0.42323651452282157,0.52107279693486586,0.51269035532994922,0.45843828715365237,0.52830188679245282,0.48648648648648651,0.55504587155963303,0.48330683624801274,0.59121621621621623,0.453125]
[null,"Nedostatečná časová kapacita pedagogických pracovníků věnovat se individuálnímu a zároveň komplexnímu rozvoji každého dítěte/žáka/studenta",0.46415356151711379,0.51764705882352946,0.4264705882352941,0.48237476808905383,0.4,0.47717842323651455,0.52107279693486586,0.45177664974619292,0.49118387909319899,0.43710691823899372,0.45559845559845558,0.38532110091743121,0.47217806041335453,0.40878378378378377,0.47265625]
[null,"Vliv sociálních sítí a médií (např. youtubeři) ",0.25508788159111934,0.18823529411764706,0.26470588235294118,0.26901669758812619,0.27,0.27800829875518673,0.25670498084291188,0.31472081218274112,0.22921914357682618,0.26415094339622641,0.24324324324324326,0.27522935779816515,0.21462639109697934,0.30067567567567566,0.30078125]
[null,"Vysoká absence dětí/žáků/studentů ",0.18455134135060131,0.12941176470588237,0.17647058823529413,0.19666048237476808,0.28000000000000003,0.16597510373443983,0.16858237547892721,0.21319796954314721,0.17380352644836272,0.22641509433962265,0.17374517374517376,0.19724770642201836,0.17965023847376788,0.22297297297297297,0.1484375]
[null,"Nejasná definice toho, co komplexní rozvoj dítěte/žáka/studenta vlastně zahrnuje ",0.12488436632747456,0.12352941176470589,0.10661764705882353,0.12615955473098331,0.15,0.15767634854771784,0.13026819923371646,0.16243654822335024,9.06801007556675E-2,0.14465408805031446,0.10038610038610038,0.10550458715596331,0.12877583465818759,0.10472972972972973,0.15234375]
[null,"Nízká motivace samotných dětí/žáků/studentů ",0.1211840888066605,8.5294117647058826E-2,0.125,0.13358070500927643,0.13,0.13278008298755187,0.14559386973180077,0.13197969543147209,0.15617128463476071,0.14150943396226415,8.4942084942084939E-2,0.10550458715596331,9.2209856915739269E-2,0.16554054054054054,8.203125E-2]
[null,"Nedostatečné materiální zabezpečení žáků/dětí/studentů (např. chybějící psací potřeby\na další pomůcky, nedostatečné prostředky na úhradu školních výletů, obědů atp.)",0.11794634597594819,8.5294117647058826E-2,0.11029411764705882,0.12430426716141002,0.06,0.16597510373443983,0.10344827586206896,0.15736040609137056,0.15113350125944586,0.12893081761006289,0.12741312741312741,6.8807339449541288E-2,0.10015898251192369,0.125,0.1171875]
[null,"Neuspokojivá spolupráce se školskými poradenskými zařízeními (pedagogickopsychologickými poradnami, speciálně pedagogickými centry)",0.11517113783533765,0.19705882352941176,7.720588235294118E-2,0.11502782931354361,0.08,0.1037344398340249,6.5134099616858232E-2,6.0913705583756347E-2,8.3123425692695208E-2,0.10062893081761007,0.12355212355212356,0.11467889908256881,0.17806041335453099,0.10810810810810811,7.8125E-2]
[null,"Nedostatečná metodická podpora pedagogických pracovníků ",8.7419056429232186E-2,9.7058823529411767E-2,0.11397058823529412,0.10575139146567718,7.0000000000000007E-2,9.1286307053941904E-2,7.662835249042145E-2,6.0913705583756347E-2,0.11083123425692695,9.1194968553459113E-2,0.10038610038610038,4.5871559633027525E-2,7.7901430842607311E-2,5.0675675675675678E-2,8.984375E-2]
[null,"Nedostatečná podpora ze strany zřizovatele ",3.1683626271970397E-2,2.6470588235294117E-2,4.779411764705882E-2,3.7105751391465679E-2,0.01,2.9045643153526972E-2,1.9157088122605363E-2,2.5380710659898477E-2,3.0226700251889168E-2,3.4591194968553458E-2,2.7027027027027029E-2,3.2110091743119268E-2,3.8155802861685212E-2,2.364864864864865E-2,3.125E-2]
[null,"Neochota pedagogických pracovníků přistupovat k dětem/žákům/studentům individuálně a vnímat je jako osobnosti ",2.3358001850138761E-2,2.9411764705882353E-2,2.5735294117647058E-2,2.5974025974025976E-2,0.02,1.2448132780082987E-2,1.9157088122605363E-2,5.076142131979695E-3,1.5113350125944584E-2,2.20125786163522E-2,4.2471042471042469E-2,9.1743119266055051E-3,2.2257551669316374E-2,4.3918918918918921E-2,2.34375E-2]
[]
["Statistická\nvýznamnost","Nedostatečná kapacita školních psychologů, speciálních pedagogů, sociálních pedagogů a dalších pozic",null,"","","","","","","-","","---","+","","","",""]
[null,"Vliv rodiny a dalších osob v blízkém okolí ",null,"--","+","","","-","","","","","","","","+++",""]
[null,"Nedostatečná časová kapacita pedagogických pracovníků věnovat se individuálnímu a zároveň komplexnímu rozvoji každého dítěte/žáka/studenta",null,"+","","","","","","","","","","-","","-",""]
[null,"Vliv sociálních sítí a médií (např. youtubeři) ",null,"--","","","","","","+","","","","","-","",""]
[null,"Vysoká absence dětí/žáků/studentů ",null,"--","","","+","","","","","+","","","","",""]
[null,"Nejasná definice toho, co komplexní rozvoj dítěte/žáka/studenta vlastně zahrnuje ",null,"","","","","","","","-","","","","","",""]
[null,"Nízká motivace samotných dětí/žáků/studentů ",null,"-","","","","","","","+","","","","-","+","-"]
[null,"Nedostatečné materiální zabezpečení žáků/dětí/studentů (např. chybějící psací potřeby\na další pomůcky, nedostatečné prostředky na úhradu školních výletů, obědů atp.)",null,"","","","","+","","","+","","","-","","",""]
[null,"Neuspokojivá spolupráce se školskými poradenskými zařízeními (pedagogickopsychologickými poradnami, speciálně pedagogickými centry)",null,"+++","-","","","","--","-","-","","","","+++","",""]
[null,"Nedostatečná metodická podpora pedagogických pracovníků ",null,"","","","","","","","","","","-","","-",""]
[null,"Nedostatečná podpora ze strany zřizovatele ",null,"","","","","","","","","","","","","",""]
[null,"Neochota pedagogických pracovníků přistupovat k dětem/žákům/studentům individuálně a vnímat je jako osobnosti ",null,"","","","","","","","","","+","","","+",""]
[]
["Celkem"]
["vyberte kategorii ze seznamu"]
[]
[]
[]
[]
[]
[]
[]
[]
[]
[]
[]
[]
[]
[]
[null,null,null,null,null," výběr více odpovědí",null,null,null,"výběr jedné odpovědi",null,null,null," všichni respondenti"]
[]
[]
[null,null,null,null,null,null,null,null,null,null,null,null,null,null,null,null,null,null,{"$f":"A1&\" | \"&A46&\" | N=\"&INDEX($5:$5,1,$T$65)","v":"Které z následujících položek nejvíce limitují komplexní rozvoj dětí/žáků/studentů ve Vaší škole?  | Celkem | N=4324"},{"$f":"MATCH($A$46,$4:$4,0)","v":3},{"$f":"INDEX($20:$31,W65,MATCH($A$46,$4:$4,0))","v":0.50624421831637367},{"$f":"INDEX($20:$31,W65,3)","v":0.50624421831637367},1]
[null,null,null,null,null,null,null,null,null,null,null,null,null,null,null,null,null,null,null,null,{"$f":"INDEX($20:$31,W66,MATCH($A$46,$4:$4,0))","v":0.49398704902867713},{"$f":"INDEX($20:$31,W66,3)","v":0.49398704902867713},2]
[null,null,null,null,null,null,null,null,null,null,null,null,null,null,null,null,null,null,null,null,{"$f":"INDEX($20:$31,W67,MATCH($A$46,$4:$4,0))","v":0.46415356151711379},{"$f":"INDEX($20:$31,W67,3)","v":0.46415356151711379},3]
[null,null,null,null,null,null,null,null,null,null,null,null,null,null,null,null,null,null,null,null,{"$f":"INDEX($20:$31,W68,MATCH($A$46,$4:$4,0))","v":0.25508788159111934},{"$f":"INDEX($20:$31,W68,3)","v":0.25508788159111934},4]
[null,null,null,null,null,null,null,null,null,null,null,null,null,null,null,null,null,null,null,null,{"$f":"INDEX($20:$31,W69,MATCH($A$46,$4:$4,0))","v":0.18455134135060131},{"$f":"INDEX($20:$31,W69,3)","v":0.18455134135060131},5]
[null,null,null,null,null,null,null,null,null,null,null,null,null,null,null,null,null,null,null,null,{"$f":"INDEX($20:$31,W70,MATCH($A$46,$4:$4,0))","v":0.12488436632747456},{"$f":"INDEX($20:$31,W70,3)","v":0.12488436632747456},6]
[null,null,null,null,null,null,null,null,null,null,null,null,null,null,null,null,null,null,null,null,{"$f":"INDEX($20:$31,W71,MATCH($A$46,$4:$4,0))","v":0.1211840888066605},{"$f":"INDEX($20:$31,W71,3)","v":0.1211840888066605},7]
[null,null,null,null,null,null,null,null,null,null,null,null,null,null,null,null,null,null,null,null,{"$f":"INDEX($20:$31,W72,MATCH($A$46,$4:$4,0))","v":0.11794634597594819},{"$f":"INDEX($20:$31,W72,3)","v":0.11794634597594819},8]
[null,null,null,null,null,null,null,null,null,null,null,null,null,null,null,null,null,null,null,null,{"$f":"INDEX($20:$31,W73,MATCH($A$46,$4:$4,0))","v":0.11517113783533765},{"$f":"INDEX($20:$31,W73,3)","v":0.11517113783533765},9]
[null,null,null,null,null,null,null,null,null,null,null,null,null,null,null,null,null,null,null,null,{"$f":"INDEX($20:$31,W74,MATCH($A$46,$4:$4,0))","v":8.7419056429232186E-2},{"$f":"INDEX($20:$31,W74,3)","v":8.7419056429232186E-2},10]
[null,null,null,null,null,null,null,null,null,null,null,null,null,null,null,null,null,null,null,null,{"$f":"INDEX($20:$31,W75,MATCH($A$46,$4:$4,0))","v":3.1683626271970397E-2},{"$f":"INDEX($20:$31,W75,3)","v":3.1683626271970397E-2},11]
[null,null,null,null,null,null,null,null,null,null,null,null,null,null,null,null,null,null,null,null,{"$f":"INDEX($20:$31,W76,MATCH($A$46,$4:$4,0))","v":2.3358001850138761E-2},{"$f":"INDEX($20:$31,W76,3)","v":2.3358001850138761E-2},12]

{"sheet":"Q10_1","index":4,"n_rows":40,"n_cols":23,"rows_kept":40,"cut":false,"hidden":false,"merged":[[2,3,2,16],[6,0,8,0],[10,0,12,0],[14,0,16,0],[18,0,18,1],[19,0,19,1]]}
["Vaše škola v posledních 12 měsících sociálně či jinak znevýhodněným dětem/žákům/studentům některou z vybraných položek?  q10_1  Školní obědy "]
[]
["zpět na obsah",null,null,"Kraj"]
[null,null,"Celkem","Hlavní město Praha","Jihočeský kraj","Jihomoravský kraj","Karlovarský kraj","Kraj Vysočina","Královéhradecký kraj","Liberecký kraj","Moravskoslezský kraj","Olomoucký kraj","Pardubický kraj","Plzeňský kraj","Středočeský kraj","Ústecký kraj","Zlínský kraj"]
["Počet respondentů (N)",null,4324,340,272,539,100,241,261,197,397,318,259,218,629,296,256]
[]
["Četnost odpovědí"," Ano, pravidelně ",632,94,39,58,22,26,43,35,73,51,39,29,62,35,26]
[null," Ano, ale pouze výjimečně ",307,78,25,25,3,15,16,9,36,21,10,8,34,15,12]
[null," Ne ",3385,168,208,456,75,200,202,153,288,246,210,181,533,246,218]
[]
["Relativní četnost odpovědí (%)"," Ano, pravidelně ",0.1461609620721554,0.27647058823529413,0.14338235294117646,0.10760667903525047,0.22,0.1078838174273859,0.16475095785440613,0.17766497461928935,0.18387909319899245,0.16037735849056603,0.15057915057915058,0.13302752293577982,9.8569157392686804E-2,0.11824324324324324,0.1015625]
[null," Ano, ale pouze výjimečně ",7.0999074930619799E-2,0.22941176470588234,9.1911764705882359E-2,4.6382189239332093E-2,0.03,6.2240663900414939E-2,6.1302681992337162E-2,4.5685279187817257E-2,9.06801007556675E-2,6.6037735849056603E-2,3.8610038610038609E-2,3.669724770642202E-2,5.4054054054054057E-2,5.0675675675675678E-2,4.6875E-2]
[null," Ne ",0.7828399629972248,0.49411764705882355,0.76470588235294112,0.84601113172541742,0.75,0.82987551867219922,0.77394636015325668,0.7766497461928934,0.72544080604534,0.77358490566037741,0.81081081081081086,0.83027522935779818,0.84737678855325915,0.83108108108108103,0.8515625]
[]
["Statistická\nvýznamnost"," Ano, pravidelně ",null,"+++","","--","+","","","","+","","","","---","","-"]
[null," Ano, ale pouze výjimečně ",null,"+++","","-","","","","","","","-","-","","",""]
[null," Ne ",null,"---","","+++","","","","","--","","","","+++","+","++"]
[]
["Celkem"]
["vyberte kategorii ze seznamu"]
[]
[]
[]
[]
[]
[]
[]
[]
[]
[]
[]
[]
[]
[]
[null,null,null,null,null," výběr více odpovědí",null,null,null,"výběr jedné odpovědi",null,null,null," všichni respondenti"]
[]
[]
[null,null,null,null,null,null,null,null,null,null,null,null,null,null,null,null,null,null,{"$f":"A1&\" | \"&A19&\" | N=\"&INDEX($5:$5,1,$T$38)","v":"Vaše škola v posledních 12 měsících sociálně či jinak znevýhodněným dětem/žákům/studentům některou z vybraných položek?  q10_1  Školní obědy  | Celkem | N=4324"},{"$f":"MATCH($A$19,$4:$4,0)","v":3},{"$f":"INDEX($11:$13,W38,MATCH($A$19,$4:$4,0))","v":0.1461609620721554},{"$f":"INDEX($11:$13,W38,3)","v":0.1461609620721554},1]
[null,null,null,null,null,null,null,null,null,null,null,null,null,null,null,null,null,null,null,null,{"$f":"INDEX($11:$13,W39,MATCH($A$19,$4:$4,0))","v":7.0999074930619799E-2},{"$f":"INDEX($11:$13,W39,3)","v":7.0999074930619799E-2},2]
[null,null,null,null,null,null,null,null,null,null,null,null,null,null,null,null,null,null,null,null,{"$f":"INDEX($11:$13,W40,MATCH($A$19,$4:$4,0))","v":0.7828399629972248},{"$f":"INDEX($11:$13,W40,3)","v":0.7828399629972248},3]

{"sheet":"Q10_2","index":5,"n_rows":40,"n_cols":23,"rows_kept":40,"cut":false,"hidden":false,"merged":[[2,3,2,16],[6,0,8,0],[10,0,12,0],[14,0,16,0],[18,0,18,1],[19,0,19,1]]}
["Vaše škola v posledních 12 měsících sociálně či jinak znevýhodněným dětem/žákům/studentům některou z vybraných položek?  q10_2  Stravování mimo obědy (svačiny, ovoce a zelenina, pitný režim mimo kohoutkovou vodu atp.) "]
[]
["zpět na obsah",null,null,"Kraj"]
[null,null,"Celkem","Hlavní město Praha","Jihočeský kraj","Jihomoravský kraj","Karlovarský kraj","Kraj Vysočina","Královéhradecký kraj","Liberecký kraj","Moravskoslezský kraj","Olomoucký kraj","Pardubický kraj","Plzeňský kraj","Středočeský kraj","Ústecký kraj","Zlínský kraj"]
["Počet respondentů (N)",null,4324,340,272,539,100,241,261,197,397,318,259,218,629,296,256]
[]
["Četnost odpovědí"," Ano, pravidelně ",444,55,31,41,12,14,31,28,45,39,31,22,45,29,21]
[null," Ano, ale pouze výjimečně ",311,36,23,28,3,15,21,16,31,26,16,10,45,28,13]
[null," Ne ",3569,249,218,470,85,212,209,153,321,253,212,186,539,239,222]
[]
["Relativní četnost odpovědí (%)"," Ano, pravidelně ",0.1026827012025902,0.16176470588235295,0.11397058823529412,7.6066790352504632E-2,0.12,5.8091286307053944E-2,0.11877394636015326,0.14213197969543148,0.11335012594458438,0.12264150943396226,0.11969111969111969,0.10091743119266056,7.1542130365659776E-2,9.7972972972972971E-2,8.203125E-2]
[null," Ano, ale pouze výjimečně ",7.1924144310823307E-2,0.10588235294117647,8.455882352941177E-2,5.1948051948051951E-2,0.03,6.2240663900414939E-2,8.0459770114942528E-2,8.1218274111675121E-2,7.8085642317380355E-2,8.1761006289308172E-2,6.1776061776061778E-2,4.5871559633027525E-2,7.1542130365659776E-2,9.45945945945946E-2,5.078125E-2]
[null," Ne ",0.82539315448658646,0.73235294117647054,0.80147058823529416,0.8719851576994434,0.85,0.8796680497925311,0.8007662835249042,0.7766497461928934,0.80856423173803527,0.79559748427672961,0.81853281853281856,0.85321100917431192,0.85691573926868048,0.80743243243243246,0.8671875]
[]
["Statistická\nvýznamnost"," Ano, pravidelně ",null,"+++","","-","","-","","","","","","","--","",""]
[null," Ano, ale pouze výjimečně ",null,"+","","","","","","","","","","","","",""]
[null," Ne ",null,"---","","++","","+","","","","","","","+","",""]
[]
["Celkem"]
["vyberte kategorii ze seznamu"]
[]
[]
[]
[]
[]
[]
[]
[]
[]
[]
[]
[]
[]
[]
[null,null,null,null,null," výběr více odpovědí",null,null,null,"výběr jedné odpovědi",null,null,null," všichni respondenti"]
[]
[]
[null,null,null,null,null,null,null,null,null,null,null,null,null,null,null,null,null,null,{"$f":"A1&\" | \"&A19&\" | N=\"&INDEX($5:$5,1,$T$38)","v":"Vaše škola v posledních 12 měsících sociálně či jinak znevýhodněným dětem/žákům/studentům některou z vybraných položek?  q10_2  Stravování mimo obědy (svačiny, ovoce a zelenina, pitný režim mimo kohoutkovou vodu atp.)  | Celkem | N=4324"},{"$f":"MATCH($A$19,$4:$4,0)","v":3},{"$f":"INDEX($11:$13,W38,MATCH($A$19,$4:$4,0))","v":0.1026827012025902},{"$f":"INDEX($11:$13,W38,3)","v":0.1026827012025902},1]
[null,null,null,null,null,null,null,null,null,null,null,null,null,null,null,null,null,null,null,null,{"$f":"INDEX($11:$13,W39,MATCH($A$19,$4:$4,0))","v":7.1924144310823307E-2},{"$f":"INDEX($11:$13,W39,3)","v":7.1924144310823307E-2},2]
[null,null,null,null,null,null,null,null,null,null,null,null,null,null,null,null,null,null,null,null,{"$f":"INDEX($11:$13,W40,MATCH($A$19,$4:$4,0))","v":0.82539315448658646},{"$f":"INDEX($11:$13,W40,3)","v":0.82539315448658646},3]

{"sheet":"Q10_3","index":6,"n_rows":40,"n_cols":23,"rows_kept":40,"cut":false,"hidden":false,"merged":[[2,3,2,16],[6,0,8,0],[10,0,12,0],[14,0,16,0],[18,0,18,1],[19,0,19,1]]}
["Vaše škola v posledních 12 měsících sociálně či jinak znevýhodněným dětem/žákům/studentům některou z vybraných položek?  q10_3  Školní pomůcky (psací potřeby, sešity, učebnice atp.)  "]
[]
["zpět na obsah",null,null,"Kraj"]
[null,null,"Celkem","Hlavní město Praha","Jihočeský kraj","Jihomoravský kraj","Karlovarský kraj","Kraj Vysočina","Královéhradecký kraj","Liberecký kraj","Moravskoslezský kraj","Olomoucký kraj","Pardubický kraj","Plzeňský kraj","Středočeský kraj","Ústecký kraj","Zlínský kraj"]
["Počet respondentů (N)",null,4324,340,272,539,100,241,261,197,397,318,259,218,629,296,256]
[]
["Četnost odpovědí"," Ano, pravidelně ",703,53,53,74,28,38,55,37,64,66,29,29,92,47,38]
[null," Ano, ale pouze výjimečně ",499,32,36,65,4,30,23,29,61,45,27,16,74,35,22]
[null," Ne ",3122,255,183,400,68,173,183,131,272,207,203,173,463,214,196]
[]
["Relativní četnost odpovědí (%)"," Ano, pravidelně ",0.1625809435707678,0.15588235294117647,0.19485294117647059,0.13729128014842301,0.28000000000000003,0.15767634854771784,0.21072796934865901,0.18781725888324874,0.16120906801007556,0.20754716981132076,0.11196911196911197,0.13302752293577982,0.14626391096979333,0.15878378378378377,0.1484375]
[null," Ano, ale pouze výjimečně ",0.11540240518038852,9.4117647058823528E-2,0.13235294117647059,0.12059369202226346,0.04,0.12448132780082988,8.8122605363984668E-2,0.14720812182741116,0.15365239294710328,0.14150943396226415,0.10424710424710425,7.3394495412844041E-2,0.11764705882352941,0.11824324324324324,8.59375E-2]
[null," Ne ",0.72201665124884362,0.75,0.67279411764705888,0.74211502782931349,0.68,0.71784232365145229,0.70114942528735635,0.6649746192893401,0.68513853904282118,0.65094339622641506,0.78378378378378377,0.79357798165137616,0.73608903020667726,0.72297297297297303,0.765625]
[]
["Statistická\nvýznamnost"," Ano, pravidelně ",null,"","","","++","","+","","","+","-","","","",""]
[null," Ano, ale pouze výjimečně ",null,"","","","-","","","","+","","","-","","",""]
[null," Ne ",null,"","","","","","","","","--","+","+","","",""]
[]
["Celkem"]
["vyberte kategorii ze seznamu"]
[]
[]
[]
[]
[]
[]
[]
[]
[]
[]
[]
[]
[]
[]
[null,null,null,null,null," výběr více odpovědí",null,null,null,"výběr jedné odpovědi",null,null,null," všichni respondenti"]
[]
[]
[null,null,null,null,null,null,null,null,null,null,null,null,null,null,null,null,null,null,{"$f":"A1&\" | \"&A19&\" | N=\"&INDEX($5:$5,1,$T$38)","v":"Vaše škola v posledních 12 měsících sociálně či jinak znevýhodněným dětem/žákům/studentům některou z vybraných položek?  q10_3  Školní pomůcky (psací potřeby, sešity, učebnice atp.)   | Celkem | N=4324"},{"$f":"MATCH($A$19,$4:$4,0)","v":3},{"$f":"INDEX($11:$13,W38,MATCH($A$19,$4:$4,0))","v":0.1625809435707678},{"$f":"INDEX($11:$13,W38,3)","v":0.1625809435707678},1]
[null,null,null,null,null,null,null,null,null,null,null,null,null,null,null,null,null,null,null,null,{"$f":"INDEX($11:$13,W39,MATCH($A$19,$4:$4,0))","v":0.11540240518038852},{"$f":"INDEX($11:$13,W39,3)","v":0.11540240518038852},2]
[null,null,null,null,null,null,null,null,null,null,null,null,null,null,null,null,null,null,null,null,{"$f":"INDEX($11:$13,W40,MATCH($A$19,$4:$4,0))","v":0.72201665124884362},{"$f":"INDEX($11:$13,W40,3)","v":0.72201665124884362},3]

{"sheet":"Q10_4","index":7,"n_rows":40,"n_cols":23,"rows_kept":40,"cut":false,"hidden":false,"merged":[[2,3,2,16],[6,0,8,0],[10,0,12,0],[14,0,16,0],[18,0,18,1],[19,0,19,1]]}
["Vaše škola v posledních 12 měsících sociálně či jinak znevýhodněným dětem/žákům/studentům některou z vybraných položek?  q10_4  Vstupné (např. do divadla, planetária, knihovny, ZOO atp.)  "]
[]
["zpět na obsah",null,null,"Kraj"]
[null,null,"Celkem","Hlavní město Praha","Jihočeský kraj","Jihomoravský kraj","Karlovarský kraj","Kraj Vysočina","Královéhradecký kraj","Liberecký kraj","Moravskoslezský kraj","Olomoucký kraj","Pardubický kraj","Plzeňský kraj","Středočeský kraj","Ústecký kraj","Zlínský kraj"]
["Počet respondentů (N)",null,4324,340,272,539,100,241,261,197,397,318,259,218,629,296,256]
[]
["Četnost odpovědí"," Ano, pravidelně ",412,44,27,26,10,21,34,25,52,34,13,20,57,28,21]
[null," Ano, ale pouze výjimečně ",661,48,52,75,19,36,37,37,70,52,35,26,90,49,35]
[null," Ne ",3251,248,193,438,71,184,190,135,275,232,211,172,482,219,200]
[]
["Relativní četnost odpovědí (%)"," Ano, pravidelně ",9.5282146160962075E-2,0.12941176470588237,9.9264705882352935E-2,4.8237476808905382E-2,0.1,8.7136929460580909E-2,0.13026819923371646,0.12690355329949238,0.13098236775818639,0.1069182389937107,5.019305019305019E-2,9.1743119266055051E-2,9.0620031796502382E-2,9.45945945945946E-2,8.203125E-2]
[null," Ano, ale pouze výjimečně ",0.15286771507863089,0.14117647058823529,0.19117647058823528,0.1391465677179963,0.19,0.14937759336099585,0.1417624521072797,0.18781725888324874,0.17632241813602015,0.16352201257861634,0.13513513513513514,0.11926605504587157,0.14308426073131955,0.16554054054054054,0.13671875]
[null," Ne ",0.75185013876040707,0.72941176470588232,0.7095588235294118,0.81261595547309828,0.71,0.76348547717842319,0.72796934865900387,0.68527918781725883,0.69269521410579349,0.72955974842767291,0.81467181467181471,0.78899082568807344,0.76629570747217801,0.73986486486486491,0.78125]
[]
["Statistická\nvýznamnost"," Ano, pravidelně ",null,"+","","---","","","+","","+","","-","","","",""]
[null," Ano, ale pouze výjimečně ",null,"","","","","","","","","","","","","",""]
[null," Ne ",null,"","","+++","","","","-","--","","+","","","",""]
[]
["Celkem"]
["vyberte kategorii ze seznamu"]
[]
[]
[]
[]
[]
[]
[]
[]
[]
[]
[]
[]
[]
[]
[null,null,null,null,null," výběr více odpovědí",null,null,null,"výběr jedné odpovědi",null,null,null," všichni respondenti"]
[]
[]
[null,null,null,null,null,null,null,null,null,null,null,null,null,null,null,null,null,null,{"$f":"A1&\" | \"&A19&\" | N=\"&INDEX($5:$5,1,$T$38)","v":"Vaše škola v posledních 12 měsících sociálně či jinak znevýhodněným dětem/žákům/studentům některou z vybraných položek?  q10_4  Vstupné (např. do divadla, planetária, knihovny, ZOO atp.)   | Celkem | N=4324"},{"$f":"MATCH($A$19,$4:$4,0)","v":3},{"$f":"INDEX($11:$13,W38,MATCH($A$19,$4:$4,0))","v":9.5282146160962075E-2},{"$f":"INDEX($11:$13,W38,3)","v":9.5282146160962075E-2},1]
[null,null,null,null,null,null,null,null,null,null,null,null,null,null,null,null,null,null,null,null,{"$f":"INDEX($11:$13,W39,MATCH($A$19,$4:$4,0))","v":0.15286771507863089},{"$f":"INDEX($11:$13,W39,3)","v":0.15286771507863089},2]
[null,null,null,null,null,null,null,null,null,null,null,null,null,null,null,null,null,null,null,null,{"$f":"INDEX($11:$13,W40,MATCH($A$19,$4:$4,0))","v":0.75185013876040707},{"$f":"INDEX($11:$13,W40,3)","v":0.75185013876040707},3]

{"sheet":"Q10_5","index":8,"n_rows":40,"n_cols":23,"rows_kept":40,"cut":false,"hidden":false,"merged":[[2,3,2,16],[6,0,8,0],[10,0,12,0],[14,0,16,0],[18,0,18,1],[19,0,19,1]]}
["Vaše škola v posledních 12 měsících sociálně či jinak znevýhodněným dětem/žákům/studentům některou z vybraných položek?  q10_5  Náklady spojené s účastí na akcích pořádaných pro danou třídu (školní výlet, škola v přírodě atp.)  "]
[]
["zpět na obsah",null,null,"Kraj"]
[null,null,"Celkem","Hlavní město Praha","Jihočeský kraj","Jihomoravský kraj","Karlovarský kraj","Kraj Vysočina","Královéhradecký kraj","Liberecký kraj","Moravskoslezský kraj","Olomoucký kraj","Pardubický kraj","Plzeňský kraj","Středočeský kraj","Ústecký kraj","Zlínský kraj"]
["Počet respondentů (N)",null,4324,340,272,539,100,241,261,197,397,318,259,218,629,296,256]
[]
["Četnost odpovědí"," Ano, pravidelně ",323,39,25,20,10,14,31,17,34,24,11,14,47,22,15]
[null," Ano, ale pouze výjimečně ",548,49,42,54,13,29,32,26,72,49,20,23,67,42,30]
[null," Ne ",3453,252,205,465,77,198,198,154,291,245,228,181,515,232,211]
[]
["Relativní četnost odpovědí (%)"," Ano, pravidelně ",7.4699352451433859E-2,0.11470588235294117,9.1911764705882359E-2,3.7105751391465679E-2,0.1,5.8091286307053944E-2,0.11877394636015326,8.6294416243654817E-2,8.5642317380352648E-2,7.5471698113207544E-2,4.2471042471042469E-2,6.4220183486238536E-2,7.472178060413355E-2,7.4324324324324328E-2,5.859375E-2]
[null," Ano, ale pouze výjimečně ",0.12673450508788159,0.14411764705882352,0.15441176470588236,0.10018552875695733,0.13,0.12033195020746888,0.12260536398467432,0.13197969543147209,0.181360201511335,0.1540880503144654,7.7220077220077218E-2,0.10550458715596331,0.10651828298887123,0.14189189189189189,0.1171875]
[null," Ne ",0.79856614246068458,0.74117647058823533,0.75367647058823528,0.86270871985157704,0.77,0.82157676348547715,0.75862068965517238,0.78172588832487311,0.73299748110831231,0.77044025157232709,0.88030888030888033,0.83027522935779818,0.81875993640699518,0.78378378378378377,0.82421875]
[]
["Statistická\nvýznamnost"," Ano, pravidelně ",null,"++","","---","","","++","","","","-","","","",""]
[null," Ano, ale pouze výjimečně ",null,"","","-","","","","","+++","","-","","","",""]
[null," Ne ",null,"--","","+++","","","","","---","","+++","","","",""]
[]
["Celkem"]
["vyberte kategorii ze seznamu"]
[]
[]
[]
[]
[]
[]
[]
[]
[]
[]
[]
[]
[]
[]
[null,null,null,null,null," výběr více odpovědí",null,null,null,"výběr jedné odpovědi",null,null,null," všichni respondenti"]
[]
[]
[null,null,null,null,null,null,null,null,null,null,null,null,null,null,null,null,null,null,{"$f":"A1&\" | \"&A19&\" | N=\"&INDEX($5:$5,1,$T$38)","v":"Vaše škola v posledních 12 měsících sociálně či jinak znevýhodněným dětem/žákům/studentům některou z vybraných položek?  q10_5  Náklady spojené s účastí na akcích pořádaných pro danou třídu (školní výlet, škola v přírodě atp.)   | Celkem | N=4324"},{"$f":"MATCH($A$19,$4:$4,0)","v":3},{"$f":"INDEX($11:$13,W38,MATCH($A$19,$4:$4,0))","v":7.4699352451433859E-2},{"$f":"INDEX($11:$13,W38,3)","v":7.4699352451433859E-2},1]
[null,null,null,null,null,null,null,null,null,null,null,null,null,null,null,null,null,null,null,null,{"$f":"INDEX($11:$13,W39,MATCH($A$19,$4:$4,0))","v":0.12673450508788159},{"$f":"INDEX($11:$13,W39,3)","v":0.12673450508788159},2]
[null,null,null,null,null,null,null,null,null,null,null,null,null,null,null,null,null,null,null,null,{"$f":"INDEX($11:$13,W40,MATCH($A$19,$4:$4,0))","v":0.79856614246068458},{"$f":"INDEX($11:$13,W40,3)","v":0.79856614246068458},3]

{"sheet":"Q10_6","index":9,"n_rows":40,"n_cols":23,"rows_kept":40,"cut":false,"hidden":false,"merged":[[2,3,2,16],[6,0,8,0],[10,0,12,0],[14,0,16,0],[18,0,18,1],[19,0,19,1]]}
["Vaše škola v posledních 12 měsících sociálně či jinak znevýhodněným dětem/žákům/studentům některou z vybraných položek?  q10_6  Náklady spojené s účastí na volitelných celoškolních akcích (např. zahraniční exkurze, lyžařské zájezdy atp.)  "]
[]
["zpět na obsah",null,null,"Kraj"]
[null,null,"Celkem","Hlavní město Praha","Jihočeský kraj","Jihomoravský kraj","Karlovarský kraj","Kraj Vysočina","Královéhradecký kraj","Liberecký kraj","Moravskoslezský kraj","Olomoucký kraj","Pardubický kraj","Plzeňský kraj","Středočeský kraj","Ústecký kraj","Zlínský kraj"]
["Počet respondentů (N)",null,4324,340,272,539,100,241,261,197,397,318,259,218,629,296,256]
[]
["Četnost odpovědí"," Ano, pravidelně ",114,15,9,6,2,8,11,10,16,8,3,6,8,8,4]
[null," Ano, ale pouze výjimečně ",166,26,12,10,5,8,14,8,21,11,8,7,21,7,8]
[null," Ne ",4044,299,251,523,93,225,236,179,360,299,248,205,600,281,244]
[]
["Relativní četnost odpovědí (%)"," Ano, pravidelně ",2.6364477335800184E-2,4.4117647058823532E-2,3.3088235294117647E-2,1.1131725417439703E-2,0.02,3.3195020746887967E-2,4.2145593869731802E-2,5.0761421319796954E-2,4.0302267002518891E-2,2.5157232704402517E-2,1.1583011583011582E-2,2.7522935779816515E-2,1.2718600953895072E-2,2.7027027027027029E-2,1.5625E-2]
[null," Ano, ale pouze výjimečně ",3.8390379278445887E-2,7.6470588235294124E-2,4.4117647058823532E-2,1.8552875695732839E-2,0.05,3.3195020746887967E-2,5.3639846743295021E-2,4.060913705583756E-2,5.2896725440806043E-2,3.4591194968553458E-2,3.0888030888030889E-2,3.2110091743119268E-2,3.3386327503974564E-2,2.364864864864865E-2,3.125E-2]
[null," Ne ",0.93524514338575393,0.87941176470588234,0.92279411764705888,0.9703153988868275,0.93,0.93360995850622408,0.90421455938697315,0.90862944162436543,0.90680100755667503,0.94025157232704404,0.9575289575289575,0.94036697247706424,0.95389507154213038,0.94932432432432434,0.953125]
[]
["Statistická\nvýznamnost"," Ano, pravidelně ",null,"+","","-","","","","+","","","","","-","",""]
[null," Ano, ale pouze výjimečně ",null,"+++","","-","","","","","","","","","","",""]
[null," Ne ",null,"---","","+++","","","-","","-","","","","+","",""]
[]
["Celkem"]
["vyberte kategorii ze seznamu"]
[]
[]
[]
[]
[]
[]
[]
[]
[]
[]
[]
[]
[]
[]
[null,null,null,null,null," výběr více odpovědí",null,null,null,"výběr jedné odpovědi",null,null,null," všichni respondenti"]
[]
[]
[null,null,null,null,null,null,null,null,null,null,null,null,null,null,null,null,null,null,{"$f":"A1&\" | \"&A19&\" | N=\"&INDEX($5:$5,1,$T$38)","v":"Vaše škola v posledních 12 měsících sociálně či jinak znevýhodněným dětem/žákům/studentům některou z vybraných položek?  q10_6  Náklady spojené s účastí na volitelných celoškolních akcích (např. zahraniční exkurze, lyžařské zájezdy atp.)   | Celkem | N=4324"},{"$f":"MATCH($A$19,$4:$4,0)","v":3},{"$f":"INDEX($11:$13,W38,MATCH($A$19,$4:$4,0))","v":2.6364477335800184E-2},{"$f":"INDEX($11:$13,W38,3)","v":2.6364477335800184E-2},1]
[null,null,null,null,null,null,null,null,null,null,null,null,null,null,null,null,null,null,null,null,{"$f":"INDEX($11:$13,W39,MATCH($A$19,$4:$4,0))","v":3.8390379278445887E-2},{"$f":"INDEX($11:$13,W39,3)","v":3.8390379278445887E-2},2]
[null,null,null,null,null,null,null,null,null,null,null,null,null,null,null,null,null,null,null,null,{"$f":"INDEX($11:$13,W40,MATCH($A$19,$4:$4,0))","v":0.93524514338575393},{"$f":"INDEX($11:$13,W40,3)","v":0.93524514338575393},3]

{"sheet":"Q10_7","index":10,"n_rows":40,"n_cols":23,"rows_kept":40,"cut":false,"hidden":false,"merged":[[2,3,2,16],[6,0,8,0],[10,0,12,0],[14,0,16,0],[18,0,18,1],[19,0,19,1]]}
["Vaše škola v posledních 12 měsících sociálně či jinak znevýhodněným dětem/žákům/studentům některou z vybraných položek?  q10_7  Náklady spojené s účastí na zájmovém vzdělávání (školní družiny, školní kluby, kroužky ve škole) "]
[]
["zpět na obsah",null,null,"Kraj"]
[null,null,"Celkem","Hlavní město Praha","Jihočeský kraj","Jihomoravský kraj","Karlovarský kraj","Kraj Vysočina","Královéhradecký kraj","Liberecký kraj","Moravskoslezský kraj","Olomoucký kraj","Pardubický kraj","Plzeňský kraj","Středočeský kraj","Ústecký kraj","Zlínský kraj"]
["Počet respondentů (N)",null,4324,340,272,539,100,241,261,197,397,318,259,218,629,296,256]
[]
["Četnost odpovědí"," Ano, pravidelně ",257,27,23,23,6,12,17,13,36,22,11,12,22,20,13]
[null," Ano, ale pouze výjimečně ",218,24,15,26,2,11,19,9,27,16,14,8,27,13,7]
[null," Ne ",3849,289,234,490,92,218,225,175,334,280,234,198,580,263,236]
[]
["Relativní četnost odpovědí (%)"," Ano, pravidelně ",5.9435707678075857E-2,7.9411764705882348E-2,8.455882352941177E-2,4.267161410018553E-2,0.06,4.9792531120331947E-2,6.5134099616858232E-2,6.5989847715736044E-2,9.06801007556675E-2,6.9182389937106917E-2,4.2471042471042469E-2,5.5045871559633031E-2,3.4976152623211444E-2,6.7567567567567571E-2,5.078125E-2]
[null," Ano, ale pouze výjimečně ",5.0416281221091583E-2,7.0588235294117646E-2,5.514705882352941E-2,4.8237476808905382E-2,0.02,4.5643153526970952E-2,7.2796934865900387E-2,4.5685279187817257E-2,6.8010075566750636E-2,5.0314465408805034E-2,5.4054054054054057E-2,3.669724770642202E-2,4.2925278219395867E-2,4.3918918918918921E-2,2.734375E-2]
[null," Ne ",0.89014801110083253,0.85,0.86029411764705888,0.90909090909090906,0.92,0.9045643153526971,0.86206896551724133,0.8883248730964467,0.84130982367758189,0.88050314465408808,0.90347490347490345,0.90825688073394495,0.92209856915739263,0.88851351351351349,0.921875]
[]
["Statistická\nvýznamnost"," Ano, pravidelně ",null,"","","","","","","","++","","","","--","",""]
[null," Ano, ale pouze výjimečně ",null,"","","","","","","","","","","","","",""]
[null," Ne ",null,"-","","","","","","","--","","","","++","",""]
[]
["Celkem"]
["vyberte kategorii ze seznamu"]
[]
[]
[]
[]
[]
[]
[]
[]
[]
[]
[]
[]
[]
[]
[null,null,null,null,null," výběr více odpovědí",null,null,null,"výběr jedné odpovědi",null,null,null," všichni respondenti"]
[]
[]
[null,null,null,null,null,null,null,null,null,null,null,null,null,null,null,null,null,null,{"$f":"A1&\" | \"&A19&\" | N=\"&INDEX($5:$5,1,$T$38)","v":"Vaše škola v posledních 12 měsících sociálně či jinak znevýhodněným dětem/žákům/studentům některou z vybraných položek?  q10_7  Náklady spojené s účastí na zájmovém vzdělávání (školní družiny, školní kluby, kroužky ve škole)  | Celkem | N=4324"},{"$f":"MATCH($A$19,$4:$4,0)","v":3},{"$f":"INDEX($11:$13,W38,MATCH($A$19,$4:$4,0))","v":5.9435707678075857E-2},{"$f":"INDEX($11:$13,W38,3)","v":5.9435707678075857E-2},1]
[null,null,null,null,null,null,null,null,null,null,null,null,null,null,null,null,null,null,null,null,{"$f":"INDEX($11:$13,W39,MATCH($A$19,$4:$4,0))","v":5.0416281221091583E-2},{"$f":"INDEX($11:$13,W39,3)","v":5.0416281221091583E-2},2]
[null,null,null,null,null,null,null,null,null,null,null,null,null,null,null,null,null,null,null,null,{"$f":"INDEX($11:$13,W40,MATCH($A$19,$4:$4,0))","v":0.89014801110083253},{"$f":"INDEX($11:$13,W40,3)","v":0.89014801110083253},3]

{"sheet":"Q10_8","index":11,"n_rows":40,"n_cols":23,"rows_kept":40,"cut":false,"hidden":false,"merged":[[2,3,2,16],[6,0,8,0],[10,0,12,0],[14,0,16,0],[18,0,18,1],[19,0,19,1]]}
["Vaše škola v posledních 12 měsících sociálně či jinak znevýhodněným dětem/žákům/studentům některou z vybraných položek?  q10_8  Poplatky za kroužky konané mimo školu  "]
[]
["zpět na obsah",null,null,"Kraj"]
[null,null,"Celkem","Hlavní město Praha","Jihočeský kraj","Jihomoravský kraj","Karlovarský kraj","Kraj Vysočina","Královéhradecký kraj","Liberecký kraj","Moravskoslezský kraj","Olomoucký kraj","Pardubický kraj","Plzeňský kraj","Středočeský kraj","Ústecký kraj","Zlínský kraj"]
["Počet respondentů (N)",null,4324,340,272,539,100,241,261,197,397,318,259,218,629,296,256]
[]
["Četnost odpovědí"," Ano, pravidelně ",36,6,3,3,0,3,2,1,1,2,3,4,4,1,3]
[null," Ano, ale pouze výjimečně ",72,8,8,7,1,4,4,4,9,8,4,0,6,6,3]
[null," Ne ",4216,326,261,529,99,234,255,192,387,308,252,214,619,289,250]
[]
["Relativní četnost odpovědí (%)"," Ano, pravidelně ",8.3256244218316375E-3,1.7647058823529412E-2,1.1029411764705883E-2,5.5658627087198514E-3,0,1.2448132780082987E-2,7.6628352490421452E-3,5.076142131979695E-3,2.5188916876574307E-3,6.2893081761006293E-3,1.1583011583011582E-2,1.834862385321101E-2,6.3593004769475362E-3,3.3783783783783786E-3,1.171875E-2]
[null," Ano, ale pouze výjimečně ",1.6651248843663275E-2,2.3529411764705882E-2,2.9411764705882353E-2,1.2987012987012988E-2,0.01,1.6597510373443983E-2,1.532567049808429E-2,2.030456852791878E-2,2.2670025188916875E-2,2.5157232704402517E-2,1.5444015444015444E-2,0,9.538950715421303E-3,2.0270270270270271E-2,1.171875E-2]
[null," Ne ",0.97502312673450509,0.95882352941176474,0.9595588235294118,0.98144712430426717,0.99,0.97095435684647302,0.97701149425287359,0.97461928934010156,0.97481108312342568,0.96855345911949686,0.97297297297297303,0.98165137614678899,0.98410174880763113,0.97635135135135132,0.9765625]
[]
["Statistická\nvýznamnost"," Ano, pravidelně ",null,"+","","","","","","","","","","","","",""]
[null," Ano, ale pouze výjimečně ",null,"","","","","","","","","","","-","","",""]
[null," Ne ",null,"-","","","","","","","","","","","","",""]
[]
["Celkem"]
["vyberte kategorii ze seznamu"]
[]
[]
[]
[]
[]
[]
[]
[]
[]
[]
[]
[]
[]
[]
[null,null,null,null,null," výběr více odpovědí",null,null,null,"výběr jedné odpovědi",null,null,null," všichni respondenti"]
[]
[]
[null,null,null,null,null,null,null,null,null,null,null,null,null,null,null,null,null,null,{"$f":"A1&\" | \"&A19&\" | N=\"&INDEX($5:$5,1,$T$38)","v":"Vaše škola v posledních 12 měsících sociálně či jinak znevýhodněným dětem/žákům/studentům některou z vybraných položek?  q10_8  Poplatky za kroužky konané mimo školu   | Celkem | N=4324"},{"$f":"MATCH($A$19,$4:$4,0)","v":3},{"$f":"INDEX($11:$13,W38,MATCH($A$19,$4:$4,0))","v":8.3256244218316375E-3},{"$f":"INDEX($11:$13,W38,3)","v":8.3256244218316375E-3},1]
[null,null,null,null,null,null,null,null,null,null,null,null,null,null,null,null,null,null,null,null,{"$f":"INDEX($11:$13,W39,MATCH($A$19,$4:$4,0))","v":1.6651248843663275E-2},{"$f":"INDEX($11:$13,W39,3)","v":1.6651248843663275E-2},2]
[null,null,null,null,null,null,null,null,null,null,null,null,null,null,null,null,null,null,null,null,{"$f":"INDEX($11:$13,W40,MATCH($A$19,$4:$4,0))","v":0.97502312673450509},{"$f":"INDEX($11:$13,W40,3)","v":0.97502312673450509},3]

{"sheet":"Q10_9","index":12,"n_rows":40,"n_cols":23,"rows_kept":40,"cut":false,"hidden":false,"merged":[[2,3,2,16],[6,0,8,0],[10,0,12,0],[14,0,16,0],[18,0,18,1],[19,0,19,1]]}
["Vaše škola v posledních 12 měsících sociálně či jinak znevýhodněným dětem/žákům/studentům některou z vybraných položek?  q10_9  Další materiální potřeby dítěte/žáka/studenta (např. vybavení na školní akce, školní taška, vybavení na tělesnou výchovu atp.)  "]
[]
["zpět na obsah",null,null,"Kraj"]
[null,null,"Celkem","Hlavní město Praha","Jihočeský kraj","Jihomoravský kraj","Karlovarský kraj","Kraj Vysočina","Královéhradecký kraj","Liberecký kraj","Moravskoslezský kraj","Olomoucký kraj","Pardubický kraj","Plzeňský kraj","Středočeský kraj","Ústecký kraj","Zlínský kraj"]
["Počet respondentů (N)",null,4324,340,272,539,100,241,261,197,397,318,259,218,629,296,256]
[]
["Četnost odpovědí"," Ano, pravidelně ",118,8,12,13,6,6,6,12,11,7,6,5,16,8,2]
[null," Ano, ale pouze výjimečně ",253,20,15,26,2,4,21,15,34,20,9,7,40,24,16]
[null," Ne ",3953,312,245,500,92,231,234,170,352,291,244,206,573,264,238]
[]
["Relativní četnost odpovědí (%)"," Ano, pravidelně ",2.7289546716003699E-2,2.3529411764705882E-2,4.4117647058823532E-2,2.4118738404452691E-2,0.06,2.4896265560165973E-2,2.2988505747126436E-2,6.0913705583756347E-2,2.7707808564231738E-2,2.20125786163522E-2,2.3166023166023165E-2,2.2935779816513763E-2,2.5437201907790145E-2,2.7027027027027029E-2,7.8125E-3]
[null," Ano, ale pouze výjimečně ",5.8510638297872342E-2,5.8823529411764705E-2,5.514705882352941E-2,4.8237476808905382E-2,0.02,1.6597510373443983E-2,8.0459770114942528E-2,7.6142131979695438E-2,8.5642317380352648E-2,6.2893081761006289E-2,3.4749034749034749E-2,3.2110091743119268E-2,6.3593004769475353E-2,8.1081081081081086E-2,6.25E-2]
[null," Ne ",0.9141998149861239,0.91764705882352937,0.90073529411764708,0.92764378478664189,0.92,0.95850622406639008,0.89655172413793105,0.86294416243654826,0.88664987405541562,0.91509433962264153,0.94208494208494209,0.94495412844036697,0.91096979332273453,0.89189189189189189,0.9296875]
[]
["Statistická\nvýznamnost"," Ano, pravidelně ",null,"","","","+","","","++","","","","","","","-"]
[null," Ano, ale pouze výjimečně ",null,"","","","","--","","","+","","","","","",""]
[null," Ne ",null,"","","","","+","","--","-","","","","","",""]
[]
["Celkem"]
["vyberte kategorii ze seznamu"]
[]
[]
[]
[]
[]
[]
[]
[]
[]
[]
[]
[]
[]
[]
[null,null,null,null,null," výběr více odpovědí",null,null,null,"výběr jedné odpovědi",null,null,null," všichni respondenti"]
[]
[]
[null,null,null,null,null,null,null,null,null,null,null,null,null,null,null,null,null,null,{"$f":"A1&\" | \"&A19&\" | N=\"&INDEX($5:$5,1,$T$38)","v":"Vaše škola v posledních 12 měsících sociálně či jinak znevýhodněným dětem/žákům/studentům některou z vybraných položek?  q10_9  Další materiální potřeby dítěte/žáka/studenta (např. vybavení na školní akce, školní taška, vybavení na tělesnou výchovu atp.)   | Celkem | N=4324"},{"$f":"MATCH($A$19,$4:$4,0)","v":3},{"$f":"INDEX($11:$13,W38,MATCH($A$19,$4:$4,0))","v":2.7289546716003699E-2},{"$f":"INDEX($11:$13,W38,3)","v":2.7289546716003699E-2},1]
[null,null,null,null,null,null,null,null,null,null,null,null,null,null,null,null,null,null,null,null,{"$f":"INDEX($11:$13,W39,MATCH($A$19,$4:$4,0))","v":5.8510638297872342E-2},{"$f":"INDEX($11:$13,W39,3)","v":5.8510638297872342E-2},2]
[null,null,null,null,null,null,null,null,null,null,null,null,null,null,null,null,null,null,null,null,{"$f":"INDEX($11:$13,W40,MATCH($A$19,$4:$4,0))","v":0.9141998149861239},{"$f":"INDEX($11:$13,W40,3)","v":0.9141998149861239},3]

{"sheet":"Q10_10","index":13,"n_rows":40,"n_cols":23,"rows_kept":40,"cut":false,"hidden":false,"merged":[[2,3,2,16],[6,0,8,0],[10,0,12,0],[14,0,16,0],[18,0,18,1],[19,0,19,1]]}
["Vaše škola v posledních 12 měsících sociálně či jinak znevýhodněným dětem/žákům/studentům některou z vybraných položek?  q10_10  Technické vybavení (notebook, tablet, internetové připojení atp.)  "]
[]
["zpět na obsah",null,null,"Kraj"]
[null,null,"Celkem","Hlavní město Praha","Jihočeský kraj","Jihomoravský kraj","Karlovarský kraj","Kraj Vysočina","Královéhradecký kraj","Liberecký kraj","Moravskoslezský kraj","Olomoucký kraj","Pardubický kraj","Plzeňský kraj","Středočeský kraj","Ústecký kraj","Zlínský kraj"]
["Počet respondentů (N)",null,4324,340,272,539,100,241,261,197,397,318,259,218,629,296,256]
[]
["Četnost odpovědí"," Ano, pravidelně ",331,23,23,40,11,26,29,19,30,24,13,14,43,25,11]
[null," Ano, ale pouze výjimečně ",320,21,21,44,4,14,21,12,43,23,12,17,46,21,21]
[null," Ne ",3673,296,228,455,85,201,211,166,324,271,234,187,540,250,224]
[]
["Relativní četnost odpovědí (%)"," Ano, pravidelně ",7.6549491211840889E-2,6.7647058823529407E-2,8.455882352941177E-2,7.4211502782931357E-2,0.11,0.1078838174273859,0.1111111111111111,9.6446700507614211E-2,7.5566750629722929E-2,7.5471698113207544E-2,5.019305019305019E-2,6.4220183486238536E-2,6.8362480127186015E-2,8.4459459459459457E-2,4.296875E-2]
[null," Ano, ale pouze výjimečně ",7.4005550416281221E-2,6.1764705882352944E-2,7.720588235294118E-2,8.1632653061224483E-2,0.04,5.8091286307053944E-2,8.0459770114942528E-2,6.0913705583756347E-2,0.10831234256926953,7.2327044025157231E-2,4.633204633204633E-2,7.7981651376146793E-2,7.3131955484896663E-2,7.0945945945945943E-2,8.203125E-2]
[null," Ne ",0.84944495837187795,0.87058823529411766,0.83823529411764708,0.8441558441558441,0.85,0.8340248962655602,0.80842911877394641,0.84263959390862941,0.81612090680100757,0.85220125786163525,0.90347490347490345,0.85779816513761464,0.85850556438791736,0.84459459459459463,0.875]
[]
["Statistická\nvýznamnost"," Ano, pravidelně ",null,"","","","","","+","","","","","","","","-"]
[null," Ano, ale pouze výjimečně ",null,"","","","","","","","++","","","","","",""]
[null," Ne ",null,"","","","","","","","","","+","","","",""]
[]
["Celkem"]
["vyberte kategorii ze seznamu"]
[]
[]
[]
[]
[]
[]
[]
[]
[]
[]
[]
[]
[]
[]
[null,null,null,null,null," výběr více odpovědí",null,null,null,"výběr jedné odpovědi",null,null,null," všichni respondenti"]
[]
[]
[null,null,null,null,null,null,null,null,null,null,null,null,null,null,null,null,null,null,{"$f":"A1&\" | \"&A19&\" | N=\"&INDEX($5:$5,1,$T$38)","v":"Vaše škola v posledních 12 měsících sociálně či jinak znevýhodněným dětem/žákům/studentům některou z vybraných položek?  q10_10  Technické vybavení (notebook, tablet, internetové připojení atp.)   | Celkem | N=4324"},{"$f":"MATCH($A$19,$4:$4,0)","v":3},{"$f":"INDEX($11:$13,W38,MATCH($A$19,$4:$4,0))","v":7.6549491211840889E-2},{"$f":"INDEX($11:$13,W38,3)","v":7.6549491211840889E-2},1]
[null,null,null,null,null,null,null,null,null,null,null,null,null,null,null,null,null,null,null,null,{"$f":"INDEX($11:$13,W39,MATCH($A$19,$4:$4,0))","v":7.4005550416281221E-2},{"$f":"INDEX($11:$13,W39,3)","v":7.4005550416281221E-2},2]
[null,null,null,null,null,null,null,null,null,null,null,null,null,null,null,null,null,null,null,null,{"$f":"INDEX($11:$13,W40,MATCH($A$19,$4:$4,0))","v":0.84944495837187795},{"$f":"INDEX($11:$13,W40,3)","v":0.84944495837187795},3]

{"sheet":"Q10_11","index":14,"n_rows":40,"n_cols":23,"rows_kept":40,"cut":false,"hidden":false,"merged":[[2,3,2,16],[6,0,8,0],[10,0,12,0],[14,0,16,0],[18,0,18,1],[19,0,19,1]]}
["Vaše škola v posledních 12 měsících sociálně či jinak znevýhodněným dětem/žákům/studentům některou z vybraných položek?  q10_11  Doučování  "]
[]
["zpět na obsah",null,null,"Kraj"]
[null,null,"Celkem","Hlavní město Praha","Jihočeský kraj","Jihomoravský kraj","Karlovarský kraj","Kraj Vysočina","Královéhradecký kraj","Liberecký kraj","Moravskoslezský kraj","Olomoucký kraj","Pardubický kraj","Plzeňský kraj","Středočeský kraj","Ústecký kraj","Zlínský kraj"]
["Počet respondentů (N)",null,4324,340,272,539,100,241,261,197,397,318,259,218,629,296,256]
[]
["Četnost odpovědí"," Ano, pravidelně ",542,44,44,65,9,39,40,29,48,43,20,25,69,33,34]
[null," Ano, ale pouze výjimečně ",119,9,7,12,1,7,9,5,18,7,10,5,16,6,7]
[null," Ne ",3663,287,221,462,90,195,212,163,331,268,229,188,544,257,215]
[]
["Relativní četnost odpovědí (%)"," Ano, pravidelně ",0.12534690101757631,0.12941176470588237,0.16176470588235295,0.12059369202226346,0.09,0.16182572614107885,0.1532567049808429,0.14720812182741116,0.12090680100755667,0.13522012578616352,7.7220077220077218E-2,0.11467889908256881,0.10969793322734499,0.11148648648648649,0.1328125]
[null," Ano, ale pouze výjimečně ",2.7520814061054579E-2,2.6470588235294117E-2,2.5735294117647058E-2,2.2263450834879406E-2,0.01,2.9045643153526972E-2,3.4482758620689655E-2,2.5380710659898477E-2,4.534005037783375E-2,2.20125786163522E-2,3.8610038610038609E-2,2.2935779816513763E-2,2.5437201907790145E-2,2.0270270270270271E-2,2.734375E-2]
[null," Ne ",0.84713228492136905,0.84411764705882353,0.8125,0.8571428571428571,0.9,0.8091286307053942,0.8122605363984674,0.82741116751269039,0.83375314861460958,0.84276729559748431,0.88416988416988418,0.86238532110091748,0.86486486486486491,0.8682432432432432,0.83984375]
[]
["Statistická\nvýznamnost"," Ano, pravidelně ",null,"","","","","","","","","","-","","","",""]
[null," Ano, ale pouze výjimečně ",null,"","","","","","","","+","","","","","",""]
[null," Ne ",null,"","","","","","","","","","","","","",""]
[]
["Celkem"]
["vyberte kategorii ze seznamu"]
[]
[]
[]
[]
[]
[]
[]
[]
[]
[]
[]
[]
[]
[]
[null,null,null,null,null," výběr více odpovědí",null,null,null,"výběr jedné odpovědi",null,null,null," všichni respondenti"]
[]
[]
[null,null,null,null,null,null,null,null,null,null,null,null,null,null,null,null,null,null,{"$f":"A1&\" | \"&A19&\" | N=\"&INDEX($5:$5,1,$T$38)","v":"Vaše škola v posledních 12 měsících sociálně či jinak znevýhodněným dětem/žákům/studentům některou z vybraných položek?  q10_11  Doučování   | Celkem | N=4324"},{"$f":"MATCH($A$19,$4:$4,0)","v":3},{"$f":"INDEX($11:$13,W38,MATCH($A$19,$4:$4,0))","v":0.12534690101757631},{"$f":"INDEX($11:$13,W38,3)","v":0.12534690101757631},1]
[null,null,null,null,null,null,null,null,null,null,null,null,null,null,null,null,null,null,null,null,{"$f":"INDEX($11:$13,W39,MATCH($A$19,$4:$4,0))","v":2.7520814061054579E-2},{"$f":"INDEX($11:$13,W39,3)","v":2.7520814061054579E-2},2]
[null,null,null,null,null,null,null,null,null,null,null,null,null,null,null,null,null,null,null,null,{"$f":"INDEX($11:$13,W40,MATCH($A$19,$4:$4,0))","v":0.84713228492136905},{"$f":"INDEX($11:$13,W40,3)","v":0.84713228492136905},3]